{"text_format":"1","workbook":"xlsx","n_sheets":10,"sheets":["Start","Eingabe","Berechnung","Output","WW","ZW","PV","EW","JW","Details"],"not_rendered":{"charts":0,"images":2,"macros":1,"external_links":0,"defined_names":4,"comments":2,"pivot_tables":1},"unopened":[],"bounds":{"document_bytes":16777216,"sheet_cells":100000,"rows_first":2000,"rows_last":500,"rows_between":2000,"halvings":0,"cell_chars":16384,"cell_head_chars":4096},"cells_cut":0,"cells_raw":0,"read":"whole","date_system":"1900"}

{"sheet":"Start","index":0,"n_rows":29,"n_cols":10,"rows_kept":29,"cut":false,"hidden":false,"merged":[[10,5,10,8],[8,5,8,6]]}
[]
[null,null,null,null,null,null,null,null,null,"© 2008 / Fotoklub Hall in Tirol"]
[null,null,null,null,null,null,null,null,null,"Version 2.3"]
[null,"Teilnehmer","JA/NEIN",null,"Sparte"]
[1,{"$f":"IF(Eingabe!B4=0,\"\",Eingabe!B4)","v":"Gottfried Weinhäupl"},{"$f":"IF(Eingabe!B4=0,\"NEIN\",\"JA\")","v":"JA"}]
[2,{"$f":"IF(Eingabe!B5=0,\"\",Eingabe!B5)","v":"Harald Burmann"},{"$f":"IF(Eingabe!B5=0,\"NEIN\",\"JA\")","v":"JA"}]
[3,{"$f":"IF(Eingabe!B6=0,\"\",Eingabe!B6)","v":"Tobias Ötzbrugger"},{"$f":"IF(Eingabe!B6=0,\"NEIN\",\"JA\")","v":"JA"}]
[4,{"$f":"IF(Eingabe!B7=0,\"\",Eingabe!B7)","v":"Helga Tötsch"},{"$f":"IF(Eingabe!B7=0,\"NEIN\",\"JA\")","v":"JA"}]
{"$rows_left_out":22}
{"sheet":"Eingabe","index":1,"n_rows":24,"n_cols":65,"rows_kept":24,"cut":false,"hidden":false,"merged":[[0,0,0,1]]}
["DATENERFASSUNG"]
[]
[null,"Kanditat","Fotoanzahl\nKanditat","Differenz X",1,2,3,4,5,6,7,8,9,10,11,12,13,14,15,16,17,18,19,20,21,22,23,24,25,26,27,28,29,30,31,32,33,34,35,36,37,38,39,40,41,42,43,44,45,46,47,48,49,50,51,52,53,54,55,56,57,58,59,60,"Kanditat"]
[1,"Gottfried Weinhäupl",3,{"$f":"IF(C4-(COUNTIF(E4:BL4,\"x\"))=0,\"-\",\"F\")","v":"-"},8,7,7,"x",8,7,8,"x",7,8,7,10,7,8,"x",null,null,null,null,null,null,null,null,null,null,null,null,null,null,null,null,null,null,null,null,null,null,null,null,null,null,null,null,null,null,null,null,null,null,null,null,null,null,null,null,null,null,null,null,null,{"$f":"B4","v":"Gottfried Weinhäupl"}]
[2,"Harald Burmann",3,"-","x",9,9,8,7,8,"x",7,6,6,8,8,9,"x",8,null,null,null,null,null,null,null,null,null,null,null,null,null,null,null,null,null,null,null,null,null,null,null,null,null,null,null,null,null,null,null,null,null,null,null,null,null,null,null,null,null,null,null,null,null,{"$f":"B5","v":"Harald Burmann"}]
[3,"Tobias Ötzbrugger",3,"-",9,"x",8,6,7,"x",7,6,5,6,"x",6,7,7,8,null,null,null,null,null,null,null,null,null,null,null,null,null,null,null,null,null,null,null,null,null,null,null,null,null,null,null,null,null,null,null,null,null,null,null,null,null,null,null,null,null,null,null,null,null,{"$f":"B6","v":"Tobias Ötzbrugger"}]
[4,"Helga Tötsch",3,"-",7,8,7,6,"x",7,8,7,"x",7,7,"x",7,8,7,null,null,null,null,null,null,null,null,null,null,null,null,null,null,null,null,null,null,null,null,null,null,null,null,null,null,null,null,null,null,null,null,null,null,null,null,null,null,null,null,null,null,null,null,null,"Helga Tötsch"]
[5,"Günther Schatz",3,"-",9,10,"x",6,10,8,10,6,7,"x",8,7,"x",9,7,null,null,null,null,null,null,null,null,null,null,null,null,null,null,null,null,null,null,null,null,null,null,null,null,null,null,null,null,null,null,null,null,null,null,null,null,null,null,null,null,null,null,null,null,null,"Günther Schatz"]
{"$rows_left_out":17}
{"sheet":"Berechnung","index":2,"n_rows":68,"n_cols":62,"rows_kept":68,"cut":false,"hidden":false,"merged":[[3,0,3,1],[7,1,17,1],[7,11,7,14],[12,11,12,14],[13,11,13,14],[16,11,16,14],[4,0,4,1],[27,11,27,14],[21,11,21,14],[22,11,22,14],[23,11,23,14],[24,11,24,14],[26,11,26,14],[18,11,18,14],[19,11,19,14],[20,11,20,14],[25,11,25,14],[7,9,17,9],[7,16,7,19],[5,0,5,1],[10,11,10,14],[11,11,11,14],[17,11,17,14],[14,11,14,14],[15,11,15,14],[8,11,8,14],[9,11,9,14]]}
[]
["Berechnung","Anzahl",1,2,3,4,5,6,7,8,9,10,11,12,13,14,15,16,17,18,19,20,21,22,23,24,25,26,27,28,29,30,31,32,33,34,35,36,37,38,39,40,41,42,43,44,45,46,47,48,49,50,51,52,53,54,55,56,57,58,59,60]
["Gesamt",{"$f":"Eingabe!C24-3","v":2},{"$f":"SUM(Eingabe!E4:E23)","v":33},{"$f":"SUM(Eingabe!F4:F23)","v":34},{"$f":"SUM(Eingabe!G4:G23)","v":31},{"$f":"SUM(Eingabe!H4:H23)","v":26},{"$f":"SUM(Eingabe!I4:I23)","v":32},{"$f":"SUM(Eingabe!J4:J23)","v":30},{"$f":"SUM(Eingabe!K4:K23)","v":33},{"$f":"SUM(Eingabe!L4:L23)","v":26},{"$f":"SUM(Eingabe!M4:M23)","v":25},{"$f":"SUM(Eingabe!N4:N23)","v":27},{"$f":"SUM(Eingabe!O4:O23)","v":30},{"$f":"SUM(Eingabe!P4:P23)","v":31},{"$f":"SUM(Eingabe!Q4:Q23)","v":30},{"$f":"SUM(Eingabe!R4:R23)","v":32},{"$f":"SUM(Eingabe!S4:S23)","v":30},{"$f":"SUM(Eingabe!T4:T23)","v":0},{"$f":"SUM(Eingabe!U4:U23)","v":0},{"$f":"SUM(Eingabe!V4:V23)","v":0},{"$f":"SUM(Eingabe!W4:W23)","v":0},{"$f":"SUM(Eingabe!X4:X23)","v":0},{"$f":"SUM(Eingabe!Y4:Y23)","v":0},{"$f":"SUM(Eingabe!Z4:Z23)","v":0},{"$f":"SUM(Eingabe!AA4:AA23)","v":0},{"$f":"SUM(Eingabe!AB4:AB23)","v":0},{"$f":"SUM(Eingabe!AC4:AC23)","v":0},{"$f":"SUM(Eingabe!AD4:AD23)","v":0},{"$f":"SUM(Eingabe!AE4:AE23)","v":0},{"$f":"SUM(Eingabe!AF4:AF23)","v":0},{"$f":"SUM(Eingabe!AG4:AG23)","v":0},{"$f":"SUM(Eingabe!AH4:AH23)","v":0},{"$f":"SUM(Eingabe!AI4:AI23)","v":0},{"$f":"SUM(Eingabe!AJ4:AJ23)","v":0},{"$f":"SUM(Eingabe!AK4:AK23)","v":0},{"$f":"SUM(Eingabe!AL4:AL23)","v":0},{"$f":"SUM(Eingabe!AM4:AM23)","v":0},{"$f":"SUM(Eingabe!AN4:AN23)","v":0},{"$f":"SUM(Eingabe!AO4:AO23)","v":0},{"$f":"SUM(Eingabe!AP4:AP23)","v":0},{"$f":"SUM(Eingabe!AQ4:AQ23)","v":0},{"$f":"SUM(Eingabe!AR4:AR23)","v":0},{"$f":"SUM(Eingabe!AS4:AS23)","v":0},{"$f":"SUM(Eingabe!AT4:AT23)","v":0},{"$f":"SUM(Eingabe!AU4:AU23)","v":0},{"$f":"SUM(Eingabe!AV4:AV23)","v":0},{"$f":"SUM(Eingabe!AW4:AW23)","v":0},{"$f":"SUM(Eingabe!AX4:AX23)","v":0},{"$f":"SUM(Eingabe!AY4:AY23)","v":0},{"$f":"SUM(Eingabe!AZ4:AZ23)","v":0},{"$f":"SUM(Eingabe!BA4:BA23)","v":0},{"$f":"SUM(Eingabe!BB4:BB23)","v":0},{"$f":"SUM(Eingabe!BC4:BC23)","v":0},{"$f":"SUM(Eingabe!BD4:BD23)","v":0},{"$f":"SUM(Eingabe!BE4:BE23)","v":0},{"$f":"SUM(Eingabe!BF4:BF23)","v":0},{"$f":"SUM(Eingabe!BG4:BG23)","v":0},{"$f":"SUM(Eingabe!BH4:BH23)","v":0},{"$f":"SUM(Eingabe!BI4:BI23)","v":0},{"$f":"SUM(Eingabe!BJ4:BJ23)","v":0},{"$f":"SUM(Eingabe!BK4:BK23)","v":0},{"$f":"SUM(Eingabe!BL4:BL23)","v":0}]
["Niedrigster Wert",null,{"$f":"IF(C3=0,\"-\",MIN(Eingabe!E4:E23))","v":7},{"$f":"IF(D3=0,\"-\",MIN(Eingabe!F4:F23))","v":7},{"$f":"IF(E3=0,\"-\",MIN(Eingabe!G4:G23))","v":7},{"$f":"IF(F3=0,\"-\",MIN(Eingabe!H4:H23))","v":6},{"$f":"IF(G3=0,\"-\",MIN(Eingabe!I4:I23))","v":7},{"$f":"IF(H3=0,\"-\",MIN(Eingabe!J4:J23))","v":7},{"$f":"IF(I3=0,\"-\",MIN(Eingabe!K4:K23))","v":7},{"$f":"IF(J3=0,\"-\",MIN(Eingabe!L4:L23))","v":6},{"$f":"IF(K3=0,\"-\",MIN(Eingabe!M4:M23))","v":5},{"$f":"IF(L3=0,\"-\",MIN(Eingabe!N4:N23))","v":6},{"$f":"IF(M3=0,\"-\",MIN(Eingabe!O4:O23))","v":7},{"$f":"IF(N3=0,\"-\",MIN(Eingabe!P4:P23))","v":6},{"$f":"IF(O3=0,\"-\",MIN(Eingabe!Q4:Q23))","v":7},{"$f":"IF(P3=0,\"-\",MIN(Eingabe!R4:R23))","v":7},{"$f":"IF(Q3=0,\"-\",MIN(Eingabe!S4:S23))","v":7},{"$f":"IF(R3=0,\"-\",MIN(Eingabe!T4:T23))","v":"-"},{"$f":"IF(S3=0,\"-\",MIN(Eingabe!U4:U23))","v":"-"},{"$f":"IF(T3=0,\"-\",MIN(Eingabe!V4:V23))","v":"-"},{"$f":"IF(U3=0,\"-\",MIN(Eingabe!W4:W23))","v":"-"},{"$f":"IF(V3=0,\"-\",MIN(Eingabe!X4:X23))","v":"-"},{"$f":"IF(W3=0,\"-\",MIN(Eingabe!Y4:Y23))","v":"-"},{"$f":"IF(X3=0,\"-\",MIN(Eingabe!Z4:Z23))","v":"-"},{"$f":"IF(Y3=0,\"-\",MIN(Eingabe!AA4:AA23))","v":"-"},{"$f":"IF(Z3=0,\"-\",MIN(Eingabe!AB4:AB23))","v":"-"},{"$f":"IF(AA3=0,\"-\",MIN(Eingabe!AC4:AC23))","v":"-"},{"$f":"IF(AB3=0,\"-\",MIN(Eingabe!AD4:AD23))","v":"-"},{"$f":"IF(AC3=0,\"-\",MIN(Eingabe!AE4:AE23))","v":"-"},{"$f":"IF(AD3=0,\"-\",MIN(Eingabe!AF4:AF23))","v":"-"},{"$f":"IF(AE3=0,\"-\",MIN(Eingabe!AG4:AG23))","v":"-"},{"$f":"IF(AF3=0,\"-\",MIN(Eingabe!AH4:AH23))","v":"-"},{"$f":"IF(AG3=0,\"-\",MIN(Eingabe!AI4:AI23))","v":"-"},{"$f":"IF(AH3=0,\"-\",MIN(Eingabe!AJ4:AJ23))","v":"-"},{"$f":"IF(AI3=0,\"-\",MIN(Eingabe!AK4:AK23))","v":"-"},{"$f":"IF(AJ3=0,\"-\",MIN(Eingabe!AL4:AL23))","v":"-"},{"$f":"IF(AK3=0,\"-\",MIN(Eingabe!AM4:AM23))","v":"-"},{"$f":"IF(AL3=0,\"-\",MIN(Eingabe!AN4:AN23))","v":"-"},{"$f":"IF(AM3=0,\"-\",MIN(Eingabe!AO4:AO23))","v":"-"},{"$f":"IF(AN3=0,\"-\",MIN(Eingabe!AP4:AP23))","v":"-"},{"$f":"IF(AO3=0,\"-\",MIN(Eingabe!AQ4:AQ23))","v":"-"},{"$f":"IF(AP3=0,\"-\",MIN(Eingabe!AR4:AR23))","v":"-"},{"$f":"IF(AQ3=0,\"-\",MIN(Eingabe!AS4:AS23))","v":"-"},{"$f":"IF(AR3=0,\"-\",MIN(Eingabe!AT4:AT23))","v":"-"},{"$f":"IF(AS3=0,\"-\",MIN(Eingabe!AU4:AU23))","v":"-"},{"$f":"IF(AT3=0,\"-\",MIN(Eingabe!AV4:AV23))","v":"-"},{"$f":"IF(AU3=0,\"-\",MIN(Eingabe!AW4:AW23))","v":"-"},{"$f":"IF(AV3=0,\"-\",MIN(Eingabe!AX4:AX23))","v":"-"},{"$f":"IF(AW3=0,\"-\",MIN(Eingabe!AY4:AY23))","v":"-"},{"$f":"IF(AX3=0,\"-\",MIN(Eingabe!AZ4:AZ23))","v":"-"},{"$f":"IF(AY3=0,\"-\",MIN(Eingabe!BA4:BA23))","v":"-"},{"$f":"IF(AZ3=0,\"-\",MIN(Eingabe!BB4:BB23))","v":"-"},{"$f":"IF(BA3=0,\"-\",MIN(Eingabe!BC4:BC23))","v":"-"},{"$f":"IF(BB3=0,\"-\",MIN(Eingabe!BD4:BD23))","v":"-"},{"$f":"IF(BC3=0,\"-\",MIN(Eingabe!BE4:BE23))","v":"-"},{"$f":"IF(BD3=0,\"-\",MIN(Eingabe!BF4:BF23))","v":"-"},{"$f":"IF(BE3=0,\"-\",MIN(Eingabe!BG4:BG23))","v":"-"},{"$f":"IF(BF3=0,\"-\",MIN(Eingabe!BH4:BH23))","v":"-"},{"$f":"IF(BG3=0,\"-\",MIN(Eingabe!BI4:BI23))","v":"-"},{"$f":"IF(BH3=0,\"-\",MIN(Eingabe!BJ4:BJ23))","v":"-"},{"$f":"IF(BI3=0,\"-\",MIN(Eingabe!BK4:BK23))","v":"-"},{"$f":"IF(BJ3=0,\"-\",MIN(Eingabe!BL4:BL23))","v":"-"}]
["Höchster Wert",null,{"$f":"IF(C3=0,\"-\",MAX(Eingabe!E4:E23))","v":9},{"$f":"IF(D3=0,\"-\",MAX(Eingabe!F4:F23))","v":10},{"$f":"IF(E3=0,\"-\",MAX(Eingabe!G4:G23))","v":9},{"$f":"IF(F3=0,\"-\",MAX(Eingabe!H4:H23))","v":8},{"$f":"IF(G3=0,\"-\",MAX(Eingabe!I4:I23))","v":10},{"$f":"IF(H3=0,\"-\",MAX(Eingabe!J4:J23))","v":8},{"$f":"IF(I3=0,\"-\",MAX(Eingabe!K4:K23))","v":10},{"$f":"IF(J3=0,\"-\",MAX(Eingabe!L4:L23))","v":7},{"$f":"IF(K3=0,\"-\",MAX(Eingabe!M4:M23))","v":7},{"$f":"IF(L3=0,\"-\",MAX(Eingabe!N4:N23))","v":8},{"$f":"IF(M3=0,\"-\",MAX(Eingabe!O4:O23))","v":8},{"$f":"IF(N3=0,\"-\",MAX(Eingabe!P4:P23))","v":10},{"$f":"IF(O3=0,\"-\",MAX(Eingabe!Q4:Q23))","v":9},{"$f":"IF(P3=0,\"-\",MAX(Eingabe!R4:R23))","v":9},{"$f":"IF(Q3=0,\"-\",MAX(Eingabe!S4:S23))","v":8},{"$f":"IF(R3=0,\"-\",MAX(Eingabe!T4:T23))","v":"-"},{"$f":"IF(S3=0,\"-\",MAX(Eingabe!U4:U23))","v":"-"},{"$f":"IF(T3=0,\"-\",MAX(Eingabe!V4:V23))","v":"-"},{"$f":"IF(U3=0,\"-\",MAX(Eingabe!W4:W23))","v":"-"},{"$f":"IF(V3=0,\"-\",MAX(Eingabe!X4:X23))","v":"-"},{"$f":"IF(W3=0,\"-\",MAX(Eingabe!Y4:Y23))","v":"-"},{"$f":"IF(X3=0,\"-\",MAX(Eingabe!Z4:Z23))","v":"-"},{"$f":"IF(Y3=0,\"-\",MAX(Eingabe!AA4:AA23))","v":"-"},{"$f":"IF(Z3=0,\"-\",MAX(Eingabe!AB4:AB23))","v":"-"},{"$f":"IF(AA3=0,\"-\",MAX(Eingabe!AC4:AC23))","v":"-"},{"$f":"IF(AB3=0,\"-\",MAX(Eingabe!AD4:AD23))","v":"-"},{"$f":"IF(AC3=0,\"-\",MAX(Eingabe!AE4:AE23))","v":"-"},{"$f":"IF(AD3=0,\"-\",MAX(Eingabe!AF4:AF23))","v":"-"},{"$f":"IF(AE3=0,\"-\",MAX(Eingabe!AG4:AG23))","v":"-"},{"$f":"IF(AF3=0,\"-\",MAX(Eingabe!AH4:AH23))","v":"-"},{"$f":"IF(AG3=0,\"-\",MAX(Eingabe!AI4:AI23))","v":"-"},{"$f":"IF(AH3=0,\"-\",MAX(Eingabe!AJ4:AJ23))","v":"-"},{"$f":"IF(AI3=0,\"-\",MAX(Eingabe!AK4:AK23))","v":"-"},{"$f":"IF(AJ3=0,\"-\",MAX(Eingabe!AL4:AL23))","v":"-"},{"$f":"IF(AK3=0,\"-\",MAX(Eingabe!AM4:AM23))","v":"-"},{"$f":"IF(AL3=0,\"-\",MAX(Eingabe!AN4:AN23))","v":"-"},{"$f":"IF(AM3=0,\"-\",MAX(Eingabe!AO4:AO23))","v":"-"},{"$f":"IF(AN3=0,\"-\",MAX(Eingabe!AP4:AP23))","v":"-"},{"$f":"IF(AO3=0,\"-\",MAX(Eingabe!AQ4:AQ23))","v":"-"},{"$f":"IF(AP3=0,\"-\",MAX(Eingabe!AR4:AR23))","v":"-"},{"$f":"IF(AQ3=0,\"-\",MAX(Eingabe!AS4:AS23))","v":"-"},{"$f":"IF(AR3=0,\"-\",MAX(Eingabe!AT4:AT23))","v":"-"},{"$f":"IF(AS3=0,\"-\",MAX(Eingabe!AU4:AU23))","v":"-"},{"$f":"IF(AT3=0,\"-\",MAX(Eingabe!AV4:AV23))","v":"-"},{"$f":"IF(AU3=0,\"-\",MAX(Eingabe!AW4:AW23))","v":"-"},{"$f":"IF(AV3=0,\"-\",MAX(Eingabe!AX4:AX23))","v":"-"},{"$f":"IF(AW3=0,\"-\",MAX(Eingabe!AY4:AY23))","v":"-"},{"$f":"IF(AX3=0,\"-\",MAX(Eingabe!AZ4:AZ23))","v":"-"},{"$f":"IF(AY3=0,\"-\",MAX(Eingabe!BA4:BA23))","v":"-"},{"$f":"IF(AZ3=0,\"-\",MAX(Eingabe!BB4:BB23))","v":"-"},{"$f":"IF(BA3=0,\"-\",MAX(Eingabe!BC4:BC23))","v":"-"},{"$f":"IF(BB3=0,\"-\",MAX(Eingabe!BD4:BD23))","v":"-"},{"$f":"IF(BC3=0,\"-\",MAX(Eingabe!BE4:BE23))","v":"-"},{"$f":"IF(BD3=0,\"-\",MAX(Eingabe!BF4:BF23))","v":"-"},{"$f":"IF(BE3=0,\"-\",MAX(Eingabe!BG4:BG23))","v":"-"},{"$f":"IF(BF3=0,\"-\",MAX(Eingabe!BH4:BH23))","v":"-"},{"$f":"IF(BG3=0,\"-\",MAX(Eingabe!BI4:BI23))","v":"-"},{"$f":"IF(BH3=0,\"-\",MAX(Eingabe!BJ4:BJ23))","v":"-"},{"$f":"IF(BI3=0,\"-\",MAX(Eingabe!BK4:BK23))","v":"-"},{"$f":"IF(BJ3=0,\"-\",MAX(Eingabe!BL4:BL23))","v":"-"}]
["Mittelwert",null,{"$f":"IF(C3=0,0,(C3-C4-C5)/$B$3)","v":8.5},{"$f":"IF(D3=0,0,(D3-D4-D5)/$B$3)","v":8.5},{"$f":"IF(E3=0,0,(E3-E4-E5)/$B$3)","v":7.5},{"$f":"IF(F3=0,0,(F3-F4-F5)/$B$3)","v":6},7.5,7.5,8,6.5,6.5,6.5,7.5,7.5,7,8,7.5,0,0,0,0,0,0,0,0,0,0,0,0,0,0,0,0,0,0,0,0,0,0,0,0,0,0,0,0,0,0,0,0,0,{"$f":"IF(AY3=0,0,(AY3-AY4-AY5)/$B$3)","v":0},0,0,0,0,0,0,0,0,0,0,0]
[]
["Sparte","DIE 6 BESTEN BILDER","MW","Z","Foto","Kanditat","MW","Zähler",null,"GESAMTERGEBNIS","Nr.","Kanditat",null,null,null,"GW","Kanditat"]
{"$rows_left_out":61}
{"sheet":"Output","index":3,"n_rows":69,"n_cols":13,"rows_kept":69,"cut":false,"hidden":false,"merged":[[4,0,5,5],[1,0,1,5],[19,11,20,11],[19,12,20,12],[17,7,18,7],[17,8,18,8],[19,7,20,7],[19,8,20,8],[19,9,20,9],[19,10,20,10],[11,7,12,7],[11,8,12,8],[11,9,12,9],[11,10,12,10],[11,11,12,11],[11,12,12,12],[9,7,10,7],[9,8,10,8],[15,7,16,7],[15,8,16,8],[15,9,16,9],[15,10,16,10],[13,7,14,7],[13,8,14,8],[13,9,14,9],[13,10,14,10],[13,11,14,11],[13,12,14,12],[15,11,16,11],[15,12,16,12],[9,9,10,9],[9,10,10,10],[61,11,62,11],[61,12,62,12],[57,11,58,11],[57,12,58,12],[59,11,60,11],[59,12,60,12],[53,11,54,11],[53,12,54,12],[9,11,10,11],[9,12,10,12],[17,9,18,9],[17,10,18,10],[17,11,18,11],[17,12,18,12],[55,11,56,11],[55,12,56,12],[63,12,64,12],[61,7,62,7],[61,8,62,8],[61,9,62,9],[61,10,62,10],[63,7,64,7],[63,8,64,8],[63,9,64,9],[63,10,64,10],[59,7,60,7],[59,8,60,8],[59,9,60,9],[59,10,60,10],[57,7,58,7],[57,8,58,8],[57,9,58,9],[57,10,58,10],[63,11,64,11],[53,7,54,7],[53,8,54,8],[53,9,54,9],[53,10,54,10],[55,7,56,7],[55,8,56,8],[55,9,56,9],[55,10,56,10],[45,12,46,12],[47,11,48,11],[47,12,48,12],[49,11,50,11],[49,12,50,12],[51,11,52,11],[51,12,52,12],[49,7,50,7],[49,8,50,8],[51,7,52,7],[51,8,52,8],[51,9,52,9],[51,10,52,10],[49,9,50,9],[49,10,50,10],[47,7,48,7],[47,8,48,8],[47,9,48,9],[47,10,48,10],[45,7,46,7],[45,8,46,8],[45,9,46,9],[45,10,46,10],[45,11,46,11],[37,12,38,12],[39,11,40,11],[39,12,40,12],[41,11,42,11],[41,12,42,12],[43,11,44,11],[43,12,44,12],[41,7,42,7],[41,8,42,8],[43,7,44,7],[43,8,44,8],[43,9,44,9],[43,10,44,10],[41,9,42,9],[41,10,42,10],[39,7,40,7],[39,8,40,8],[39,9,40,9],[39,10,40,10],[37,7,38,7],[37,8,38,8],[37,9,38,9],[37,10,38,10],[37,11,38,11],[29,12,30,12],[31,11,32,11],[31,12,32,12],[33,11,34,11],[33,12,34,12],[35,11,36,11],[35,12,36,12],[33,7,34,7],[33,8,34,8],[35,7,36,7],[35,8,36,8],[35,9,36,9],[35,10,36,10],[33,9,34,9],[33,10,34,10],[31,7,32,7],[31,8,32,8],[31,9,32,9],[31,10,32,10],[29,7,30,7],[29,8,30,8],[29,9,30,9],[29,10,30,10],[29,11,30,11],[25,11,26,11],[25,12,26,12],[27,11,28,11],[27,12,28,12],[27,9,28,9],[27,10,28,10],[25,9,26,9],[25,10,26,10],[25,7,26,7],[25,8,26,8],[27,7,28,7],[27,8,28,8]]}
["Teilnehmer",null,null,null,null,null,null,null,"Sparte"]
[{"$f":"+VLOOKUP(Berechnung!A12,Start!A5:B29,2,FALSE)","v":"Homepage"},null,null,null,null,null,null,null,{"$f":"IF(Berechnung!A9=1,\"Schwarz/Weiß-Bild\",IF(Berechnung!A9=2,\"Farbbild\",IF(Berechnung!A9=3,\"Projektionsbild\",\"FEHLER\")))","v":"Projektionsbild"}]
[]
["Thema:",null,null,null,null,null,null,null,"Datum "]
[{"$f":"Start!F11","v":"FREI"},null,null,null,null,null,null,null,{"$f":"Start!F9","v":"2023-10-10"}]
[null,null,null,null,null,null,null,null,null,null,null,null,"Erlerstraße 2, 6060 Hall i.T."]
[]
[">>> EINZELWERTUNG",null,null,null,null,null,null,">>> DIE 6 BESTEN BILDER"]
{"$rows_left_out":62}
{"sheet":"WW","index":4,"n_rows":22,"n_cols":2,"rows_kept":22,"cut":false,"hidden":false,"merged":[]}
["GESAMTERGEBNIS"]
[]
[24.5,"Harald Burmann"]
[23.5,"Tobias Ötzbrugger"]
[21.5,"Helga Tötsch"]
[21,"Günther Schatz"]
[20,"Gottfried Weinhäupl"]
[0,""]
{"$rows_left_out":15}
{"sheet":"ZW","index":5,"n_rows":62,"n_cols":4,"rows_kept":62,"cut":false,"hidden":false,"merged":[]}
["DIE 6 BESTEN BILDER"]
[]
[8.5,1,1,"Harald Burmann"]
[8.5,1,2,"Tobias Ötzbrugger"]
[8,1,7,"Harald Burmann"]
[8,1,14,"Harald Burmann"]
[7.5,1,3,"Günther Schatz"]
[7.5,1,5,"Helga Tötsch"]
{"$rows_left_out":55}
{"sheet":"PV","index":6,"n_rows":11,"n_cols":6,"rows_kept":11,"cut":false,"hidden":false,"merged":[]}
[]
[]
["Summe von MW","Zähler"]
["Kanditat",1,2,3,null,"Gesamtergebnis"]
[null,null,null,null,0,0]
["Harald Burmann",8.5,8,8,null,24.5]
["Tobias Ötzbrugger",8.5,7.5,7.5,null,23.5]
["Günther Schatz",7.5,6.5,7,null,21]
{"$rows_left_out":4}
{"sheet":"EW","index":7,"n_rows":62,"n_cols":22,"rows_kept":62,"cut":false,"hidden":false,"merged":[]}
[null,"TN: 1","TN: 2","TN: 3","TN: 4","TN: 5","TN: 6","TN: 7","TN: 8","TN: 9","TN: 10","TN: 11","TN: 12","TN: 13","TN: 14","TN: 15","TN: 16","TN: 17","TN: 18","TN: 19","TN: 20","Rest"]
["Bild",{"$f":"IF(Start!$B$5=\"\",\"---\")","v":false},{"$f":"IF(Start!$B$5=\"\",\"---\")","v":false},{"$f":"IF(Start!$B$5=\"\",\"---\")","v":false},{"$f":"IF(Start!$B$5=\"\",\"---\")","v":false},{"$f":"IF(Start!$B$5=\"\",\"---\")","v":false},{"$f":"IF(Start!$B$5=\"\",\"---\")","v":false},{"$f":"IF(Start!$B$5=\"\",\"---\")","v":false},{"$f":"IF(Start!$B$5=\"\",\"---\")","v":false},{"$f":"IF(Start!$B$5=\"\",\"---\")","v":false},{"$f":"IF(Start!$B$5=\"\",\"---\")","v":false},{"$f":"IF(Start!$B$5=\"\",\"---\")","v":false},{"$f":"IF(Start!$B$5=\"\",\"---\")","v":false},{"$f":"IF(Start!$B$5=\"\",\"---\")","v":false},{"$f":"IF(Start!$B$5=\"\",\"---\")","v":false},{"$f":"IF(Start!$B$5=\"\",\"---\")","v":false},{"$f":"IF(Start!$B$5=\"\",\"---\")","v":false},{"$f":"IF(Start!$B$5=\"\",\"---\")","v":false},{"$f":"IF(Start!$B$5=\"\",\"---\")","v":false},{"$f":"IF(Start!$B$5=\"\",\"---\")","v":false},{"$f":"IF(Start!$B$5=\"\",\"---\")","v":false},"xxxxxxx"]
[1,{"$f":"Eingabe!$E4","v":8},{"$f":"Eingabe!$E5","v":"x"},{"$f":"Eingabe!$E6","v":9},{"$f":"Eingabe!$E7","v":7},{"$f":"Eingabe!$E8","v":9},{"$f":"Eingabe!$E9","v":0},{"$f":"Eingabe!$E10","v":0},{"$f":"Eingabe!$E11","v":0},{"$f":"Eingabe!$E12","v":0},{"$f":"Eingabe!$E13","v":0},{"$f":"Eingabe!$E14","v":0},{"$f":"Eingabe!$E15","v":0},{"$f":"Eingabe!$E16","v":0},{"$f":"Eingabe!$E17","v":0},{"$f":"Eingabe!$E18","v":0},{"$f":"Eingabe!$E19","v":0},{"$f":"Eingabe!$E20","v":0},{"$f":"Eingabe!$E21","v":0},{"$f":"Eingabe!$E22","v":0},{"$f":"Eingabe!$E23","v":0}]
[2,{"$f":"Eingabe!$F$4","v":7},{"$f":"Eingabe!$F$5","v":9},{"$f":"Eingabe!$F$6","v":"x"},{"$f":"Eingabe!$F$7","v":8},{"$f":"Eingabe!$F$8","v":10},{"$f":"Eingabe!$F$9","v":0},{"$f":"Eingabe!$F$10","v":0},{"$f":"Eingabe!$F$11","v":0},{"$f":"Eingabe!$F$12","v":0},{"$f":"Eingabe!$F$13","v":0},{"$f":"Eingabe!$F$14","v":0},{"$f":"Eingabe!$F$15","v":0},{"$f":"Eingabe!$F$16","v":0},{"$f":"Eingabe!$F$17","v":0},{"$f":"Eingabe!$F$18","v":0},{"$f":"Eingabe!$F$19","v":0},{"$f":"Eingabe!$F$20","v":0},{"$f":"Eingabe!$F$21","v":0},{"$f":"Eingabe!$F$22","v":0},{"$f":"Eingabe!$F$23","v":0}]
[3,{"$f":"Eingabe!$G$4","v":7},{"$f":"Eingabe!$G$5","v":9},{"$f":"Eingabe!$G$6","v":8},{"$f":"Eingabe!$G$7","v":7},{"$f":"Eingabe!$G$8","v":"x"},{"$f":"Eingabe!$G$9","v":0},{"$f":"Eingabe!$G$10","v":0},{"$f":"Eingabe!$G$11","v":0},{"$f":"Eingabe!$G$12","v":0},{"$f":"Eingabe!$G$13","v":0},{"$f":"Eingabe!$G$14","v":0},{"$f":"Eingabe!$G$15","v":0},{"$f":"Eingabe!$G$16","v":0},{"$f":"Eingabe!$G$17","v":0},{"$f":"Eingabe!$G$18","v":0},{"$f":"Eingabe!$G$19","v":0},{"$f":"Eingabe!$G$20","v":0},{"$f":"Eingabe!$G$21","v":0},{"$f":"Eingabe!$G$22","v":0},{"$f":"Eingabe!$G$23","v":0}]
[4,{"$f":"Eingabe!$H$4","v":"x"},{"$f":"Eingabe!$H$5","v":8},{"$f":"Eingabe!$H$6","v":6},{"$f":"Eingabe!$H$7","v":6},{"$f":"Eingabe!$H$8","v":6},{"$f":"Eingabe!$H$9","v":0},{"$f":"Eingabe!$H$10","v":0},{"$f":"Eingabe!$H$11","v":0},{"$f":"Eingabe!$H$12","v":0},{"$f":"Eingabe!$H$13","v":0},{"$f":"Eingabe!$H$14","v":0},{"$f":"Eingabe!$H$15","v":0},{"$f":"Eingabe!$H$16","v":0},{"$f":"Eingabe!$H$17","v":0},{"$f":"Eingabe!$H$18","v":0},{"$f":"Eingabe!$H$19","v":0},{"$f":"Eingabe!$H$20","v":0},{"$f":"Eingabe!$H$21","v":0},{"$f":"Eingabe!$H$22","v":0},{"$f":"Eingabe!$H$23","v":0}]
[5,{"$f":"Eingabe!$I$4","v":8},{"$f":"Eingabe!$I$5","v":7},{"$f":"Eingabe!$I$6","v":7},{"$f":"Eingabe!$I$7","v":"x"},{"$f":"Eingabe!$I$8","v":10},{"$f":"Eingabe!$I$9","v":0},{"$f":"Eingabe!$I$10","v":0},{"$f":"Eingabe!$I$11","v":0},{"$f":"Eingabe!$I$12","v":0},{"$f":"Eingabe!$I$13","v":0},{"$f":"Eingabe!$I$14","v":0},{"$f":"Eingabe!$I$15","v":0},{"$f":"Eingabe!$I$16","v":0},{"$f":"Eingabe!$I$17","v":0},{"$f":"Eingabe!$I$18","v":0},{"$f":"Eingabe!$I$19","v":0},{"$f":"Eingabe!$I$20","v":0},{"$f":"Eingabe!$I$21","v":0},{"$f":"Eingabe!$I$22","v":0},{"$f":"Eingabe!$I$23","v":0}]
[6,{"$f":"Eingabe!$J$4","v":7},{"$f":"Eingabe!$J$5","v":8},{"$f":"Eingabe!$J$6","v":"x"},{"$f":"Eingabe!$J$7","v":7},{"$f":"Eingabe!$J$8","v":8},{"$f":"Eingabe!$J$9","v":0},{"$f":"Eingabe!$J$10","v":0},{"$f":"Eingabe!$J$11","v":0},{"$f":"Eingabe!$J$12","v":0},{"$f":"Eingabe!$J$13","v":0},{"$f":"Eingabe!$J$14","v":0},{"$f":"Eingabe!$J$15","v":0},{"$f":"Eingabe!$J$16","v":0},{"$f":"Eingabe!$J$17","v":0},{"$f":"Eingabe!$J$18","v":0},{"$f":"Eingabe!$J$19","v":0},{"$f":"Eingabe!$J$20","v":0},{"$f":"Eingabe!$J$21","v":0},{"$f":"Eingabe!$J$22","v":0},{"$f":"Eingabe!$J$23","v":0}]
{"$rows_left_out":55}
{"sheet":"JW","index":8,"n_rows":23,"n_cols":6,"rows_kept":23,"cut":false,"hidden":false,"merged":[]}
[{"$f":"Start!F9","v":"2023-10-10"},"FB-Bild"]
["Thema",{"$f":"IF(Berechnung!A9=1,\"SW-Bild\",IF(Berechnung!A9=2,\"Farbbild\",\"Projektionsbild\"))","v":"Projektionsbild"}]
["Platz","Name","Wertung","Bild 1","Bild 2","Bild 3"]
[1,{"$f":"Output!I26","v":"Harald Burmann"},{"$f":"Output!J26","v":24.5},{"$f":"Output!K26","v":8.5},{"$f":"Output!L26","v":8},{"$f":"Output!M26","v":8}]
[2,{"$f":"Output!I28","v":"Tobias Ötzbrugger"},{"$f":"Output!J28","v":23.5},{"$f":"Output!K28","v":8.5},{"$f":"Output!L28","v":7.5},{"$f":"Output!M28","v":7.5}]
[3,{"$f":"Output!I30","v":"Helga Tötsch"},{"$f":"Output!J30","v":21.5},{"$f":"Output!K30","v":7.5},{"$f":"Output!L30","v":6.5},{"$f":"Output!M30","v":7.5}]
[4,{"$f":"Output!I32","v":"Günther Schatz"},{"$f":"Output!J32","v":21},{"$f":"Output!K32","v":7.5},{"$f":"Output!L32","v":6.5},{"$f":"Output!M32","v":7}]
[5,{"$f":"Output!I34","v":"Gottfried Weinhäupl"},{"$f":"Output!J34","v":20},{"$f":"Output!K34","v":6},{"$f":"Output!L34","v":6.5},{"$f":"Output!M34","v":7.5}]
{"$rows_left_out":16}
{"sheet":"Details","index":9,"n_rows":69,"n_cols":13,"rows_kept":69,"cut":false,"hidden":false,"merged":[[1,0,1,2],[4,0,4,2],[4,4,4,7],[1,4,1,7]]}
["Teilnehmer",null,null,null,"Sparte"]
[{"$f":"+VLOOKUP(Berechnung!A12,Start!A5:B29,2,FALSE)","v":"Homepage"},null,null,null,{"$f":"Output!I2","v":"Projektionsbild"}]
[]
["Thema:",null,null,null,"Datum:"]
[{"$f":"Start!F11","v":"FREI"},null,null,null,{"$f":"Output!I5","v":"2023-10-10"}]
[]
[]
[">>> EINZELWERTUNG"]
{"$rows_left_out":61}