{"text_format":"1","workbook":"xlsx","n_sheets":10,"sheets":["Start","Eingabe","Berechnung","Output","WW","ZW","PV","EW","JW","Details"],"not_rendered":{"charts":0,"images":2,"macros":1,"external_links":0,"defined_names":4,"comments":2,"pivot_tables":1},"unopened":[],"bounds":{"document_bytes":16777216,"sheet_cells":100000,"rows_first":2000,"rows_last":500,"rows_between":2000,"halvings":0,"cell_chars":16384,"cell_head_chars":4096},"cells_cut":0,"cells_raw":0,"read":"whole","date_system":"1900"}

{"sheet":"Start","index":0,"n_rows":29,"n_cols":10,"rows_kept":29,"cut":false,"hidden":false,"merged":[[10,5,10,8],[8,5,8,6]]}
[]
[null,null,null,null,null,null,null,null,null,"© 2008 / Fotoklub Hall in Tirol"]
[null,null,null,null,null,null,null,null,null,"Version 2.3"]
[null,"Teilnehmer","JA/NEIN",null,"Sparte"]
[1,{"$f":"IF(Eingabe!B4=0,\"\",Eingabe!B4)","v":"Gottfried Weinhäupl"},{"$f":"IF(Eingabe!B4=0,\"NEIN\",\"JA\")","v":"JA"}]
[2,{"$f":"IF(Eingabe!B5=0,\"\",Eingabe!B5)","v":"Harald Burmann"},{"$f":"IF(Eingabe!B5=0,\"NEIN\",\"JA\")","v":"JA"}]
[3,{"$f":"IF(Eingabe!B6=0,\"\",Eingabe!B6)","v":"Tobias Ötzbrugger"},{"$f":"IF(Eingabe!B6=0,\"NEIN\",\"JA\")","v":"JA"}]
[4,{"$f":"IF(Eingabe!B7=0,\"\",Eingabe!B7)","v":"Helga Tötsch"},{"$f":"IF(Eingabe!B7=0,\"NEIN\",\"JA\")","v":"JA"}]
[5,{"$f":"IF(Eingabe!B8=0,\"\",Eingabe!B8)","v":"Günther Schatz"},{"$f":"IF(Eingabe!B8=0,\"NEIN\",\"JA\")","v":"JA"},null,"Datum:","2023-10-10"]
[6,{"$f":"IF(Eingabe!B9=0,\"\",Eingabe!B9)","v":""},{"$f":"IF(Eingabe!B9=0,\"NEIN\",\"JA\")","v":"NEIN"}]
[7,{"$f":"IF(Eingabe!B10=0,\"\",Eingabe!B10)","v":""},{"$f":"IF(Eingabe!B10=0,\"NEIN\",\"JA\")","v":"NEIN"},null,"Thema:","FREI"]
[8,{"$f":"IF(Eingabe!B11=0,\"\",Eingabe!B11)","v":""},{"$f":"IF(Eingabe!B11=0,\"NEIN\",\"JA\")","v":"NEIN"}]
[9,{"$f":"IF(Eingabe!B12=0,\"\",Eingabe!B12)","v":""},{"$f":"IF(Eingabe!B12=0,\"NEIN\",\"JA\")","v":"NEIN"}]
[10,{"$f":"IF(Eingabe!B13=0,\"\",Eingabe!B13)","v":""},{"$f":"IF(Eingabe!B13=0,\"NEIN\",\"JA\")","v":"NEIN"}]
[11,{"$f":"IF(Eingabe!B14=0,\"\",Eingabe!B14)","v":""},{"$f":"IF(Eingabe!B14=0,\"NEIN\",\"JA\")","v":"NEIN"}]
[12,{"$f":"IF(Eingabe!B15=0,\"\",Eingabe!B15)","v":""},{"$f":"IF(Eingabe!B15=0,\"NEIN\",\"JA\")","v":"NEIN"}]
[13,{"$f":"IF(Eingabe!B16=0,\"\",Eingabe!B16)","v":""},{"$f":"IF(Eingabe!B16=0,\"NEIN\",\"JA\")","v":"NEIN"}]
[14,{"$f":"IF(Eingabe!B17=0,\"\",Eingabe!B17)","v":""},{"$f":"IF(Eingabe!B17=0,\"NEIN\",\"JA\")","v":"NEIN"}]
[15,{"$f":"IF(Eingabe!B18=0,\"\",Eingabe!B18)","v":""},{"$f":"IF(Eingabe!B18=0,\"NEIN\",\"JA\")","v":"NEIN"}]
[16,{"$f":"IF(Eingabe!B19=0,\"\",Eingabe!B19)","v":""},{"$f":"IF(Eingabe!B19=0,\"NEIN\",\"JA\")","v":"NEIN"}]
[17,{"$f":"IF(Eingabe!B20=0,\"\",Eingabe!B20)","v":""},{"$f":"IF(Eingabe!B20=0,\"NEIN\",\"JA\")","v":"NEIN"}]
[18,{"$f":"IF(Eingabe!B21=0,\"\",Eingabe!B21)","v":""},{"$f":"IF(Eingabe!B21=0,\"NEIN\",\"JA\")","v":"NEIN"}]
[19,{"$f":"IF(Eingabe!B22=0,\"\",Eingabe!B22)","v":""},{"$f":"IF(Eingabe!B22=0,\"NEIN\",\"JA\")","v":"NEIN"}]
[20,{"$f":"IF(Eingabe!B23=0,\"\",Eingabe!B23)","v":""},{"$f":"IF(Eingabe!B23=0,\"NEIN\",\"JA\")","v":"NEIN"}]
[21,null,{"$f":"IF(B25=0,\"NEIN\",\"JA\")","v":"NEIN"}]
[22,null,{"$f":"IF(B26=0,\"NEIN\",\"JA\")","v":"NEIN"}]
[23,null,{"$f":"IF(B27=0,\"NEIN\",\"JA\")","v":"NEIN"}]
[24,"Schriftführer","NEIN"]
[25,"Homepage",{"$f":"IF(B29=\"\",\"NEIN\",\"JA\")","v":"JA"}]

{"sheet":"Eingabe","index":1,"n_rows":24,"n_cols":65,"rows_kept":24,"cut":false,"hidden":false,"merged":[[0,0,0,1]]}
["DATENERFASSUNG"]
[]
[null,"Kanditat","Fotoanzahl\nKanditat","Differenz X",1,2,3,4,5,6,7,8,9,10,11,12,13,14,15,16,17,18,19,20,21,22,23,24,25,26,27,28,29,30,31,32,33,34,35,36,37,38,39,40,41,42,43,44,45,46,47,48,49,50,51,52,53,54,55,56,57,58,59,60,"Kanditat"]
[1,"Gottfried Weinhäupl",3,{"$f":"IF(C4-(COUNTIF(E4:BL4,\"x\"))=0,\"-\",\"F\")","v":"-"},8,7,7,"x",8,7,8,"x",7,8,7,10,7,8,"x",null,null,null,null,null,null,null,null,null,null,null,null,null,null,null,null,null,null,null,null,null,null,null,null,null,null,null,null,null,null,null,null,null,null,null,null,null,null,null,null,null,null,null,null,null,{"$f":"B4","v":"Gottfried Weinhäupl"}]
[2,"Harald Burmann",3,"-","x",9,9,8,7,8,"x",7,6,6,8,8,9,"x",8,null,null,null,null,null,null,null,null,null,null,null,null,null,null,null,null,null,null,null,null,null,null,null,null,null,null,null,null,null,null,null,null,null,null,null,null,null,null,null,null,null,null,null,null,null,{"$f":"B5","v":"Harald Burmann"}]
[3,"Tobias Ötzbrugger",3,"-",9,"x",8,6,7,"x",7,6,5,6,"x",6,7,7,8,null,null,null,null,null,null,null,null,null,null,null,null,null,null,null,null,null,null,null,null,null,null,null,null,null,null,null,null,null,null,null,null,null,null,null,null,null,null,null,null,null,null,null,null,null,{"$f":"B6","v":"Tobias Ötzbrugger"}]
[4,"Helga Tötsch",3,"-",7,8,7,6,"x",7,8,7,"x",7,7,"x",7,8,7,null,null,null,null,null,null,null,null,null,null,null,null,null,null,null,null,null,null,null,null,null,null,null,null,null,null,null,null,null,null,null,null,null,null,null,null,null,null,null,null,null,null,null,null,null,"Helga Tötsch"]
[5,"Günther Schatz",3,"-",9,10,"x",6,10,8,10,6,7,"x",8,7,"x",9,7,null,null,null,null,null,null,null,null,null,null,null,null,null,null,null,null,null,null,null,null,null,null,null,null,null,null,null,null,null,null,null,null,null,null,null,null,null,null,null,null,null,null,null,null,null,"Günther Schatz"]
[6,null,null,"-",null,null,null,null,null,null,null,null,null,null,null,null,null,null,null,null,null,null,null,null,null,null,null,null,null,null,null,null,null,null,null,null,null,null,null,null,null,null,null,null,null,null,null,null,null,null,null,null,null,null,null,null,null,null,null,null,null,null,null,null,0]
[7,null,null,"-",null,null,null,null,null,null,null,null,null,null,null,null,null,null,null,null,null,null,null,null,null,null,null,null,null,null,null,null,null,null,null,null,null,null,null,null,null,null,null,null,null,null,null,null,null,null,null,null,null,null,null,null,null,null,null,null,null,null,null,null,0]
[8,null,null,"-",null,null,null,null,null,null,null,null,null,null,null,null,null,null,null,null,null,null,null,null,null,null,null,null,null,null,null,null,null,null,null,null,null,null,null,null,null,null,null,null,null,null,null,null,null,null,null,null,null,null,null,null,null,null,null,null,null,null,null,null,0]
[9,null,null,"-",null,null,null,null,null,null,null,null,null,null,null,null,null,null,null,null,null,null,null,null,null,null,null,null,null,null,null,null,null,null,null,null,null,null,null,null,null,null,null,null,null,null,null,null,null,null,null,null,null,null,null,null,null,null,null,null,null,null,null,null,0]
[10,null,null,"-",null,null,null,null,null,null,null,null,null,null,null,null,null,null,null,null,null,null,null,null,null,null,null,null,null,null,null,null,null,null,null,null,null,null,null,null,null,null,null,null,null,null,null,null,null,null,null,null,null,null,null,null,null,null,null,null,null,null,null,null,0]
[11,null,null,"-",null,null,null,null,null,null,null,null,null,null,null,null,null,null,null,null,null,null,null,null,null,null,null,null,null,null,null,null,null,null,null,null,null,null,null,null,null,null,null,null,null,null,null,null,null,null,null,null,null,null,null,null,null,null,null,null,null,null,null,null,0]
[12,null,null,"-",null,null,null,null,null,null,null,null,null,null,null,null,null,null,null,null,null,null,null,null,null,null,null,null,null,null,null,null,null,null,null,null,null,null,null,null,null,null,null,null,null,null,null,null,null,null,null,null,null,null,null,null,null,null,null,null,null,null,null,null,0]
[13,null,null,"-",null,null,null,null,null,null,null,null,null,null,null,null,null,null,null,null,null,null,null,null,null,null,null,null,null,null,null,null,null,null,null,null,null,null,null,null,null,null,null,null,null,null,null,null,null,null,null,null,null,null,null,null,null,null,null,null,null,null,null,null,0]
[14,null,null,"-",null,null,null,null,null,null,null,null,null,null,null,null,null,null,null,null,null,null,null,null,null,null,null,null,null,null,null,null,null,null,null,null,null,null,null,null,null,null,null,null,null,null,null,null,null,null,null,null,null,null,null,null,null,null,null,null,null,null,null,null,0]
[15,null,null,"-",null,null,null,null,null,null,null,null,null,null,null,null,null,null,null,null,null,null,null,null,null,null,null,null,null,null,null,null,null,null,null,null,null,null,null,null,null,null,null,null,null,null,null,null,null,null,null,null,null,null,null,null,null,null,null,null,null,null,null,null,0]
[16,null,null,"-",null,null,null,null,null,null,null,null,null,null,null,null,null,null,null,null,null,null,null,null,null,null,null,null,null,null,null,null,null,null,null,null,null,null,null,null,null,null,null,null,null,null,null,null,null,null,null,null,null,null,null,null,null,null,null,null,null,null,null,null,0]
[17,null,null,"-",null,null,null,null,null,null,null,null,null,null,null,null,null,null,null,null,null,null,null,null,null,null,null,null,null,null,null,null,null,null,null,null,null,null,null,null,null,null,null,null,null,null,null,null,null,null,null,null,null,null,null,null,null,null,null,null,null,null,null,null,0]
[18,null,null,"-",null,null,null,null,null,null,null,null,null,null,null,null,null,null,null,null,null,null,null,null,null,null,null,null,null,null,null,null,null,null,null,null,null,null,null,null,null,null,null,null,null,null,null,null,null,null,null,null,null,null,null,null,null,null,null,null,null,null,null,null,0]
[19,null,null,"-",null,null,null,null,null,null,null,null,null,null,null,null,null,null,null,null,null,null,null,null,null,null,null,null,null,null,null,null,null,null,null,null,null,null,null,null,null,null,null,null,null,null,null,null,null,null,null,null,null,null,null,null,null,null,null,null,null,null,null,null,0]
[20,null,null,"-",null,null,null,null,null,null,null,null,null,null,null,null,null,null,null,null,null,null,null,null,null,null,null,null,null,null,null,null,null,null,null,null,null,null,null,null,null,null,null,null,null,null,null,null,null,null,null,null,null,null,null,null,null,null,null,null,null,null,null,null,0]
[null,null,{"$f":"COUNTIF(C4:C23,3)","v":5},null,{"$f":"IF(SUM(E4:E23)>0,IF(COUNTIF(E4:E23,\"x\")=1,\"-\",\"F\"),\"-\")","v":"-"},"-","-","-","-","-","-","-","-","-","-","-","-","-","-","-","-","-","-","-","-","-","-","-","-","-","-","-","-","-","-","-",{"$f":"IF(SUM(AK4:AK23)>0,IF(COUNTIF(AK4:AK23,\"x\")=1,\"-\",\"F\"),\"-\")","v":"-"},"-","-","-","-","-","-","-","-","-","-","-","-","-","-","-","-","-","-","-","-","-","-","-","-","-","-","-"]

{"sheet":"Berechnung","index":2,"n_rows":68,"n_cols":62,"rows_kept":68,"cut":false,"hidden":false,"merged":[[3,0,3,1],[7,1,17,1],[7,11,7,14],[12,11,12,14],[13,11,13,14],[16,11,16,14],[4,0,4,1],[27,11,27,14],[21,11,21,14],[22,11,22,14],[23,11,23,14],[24,11,24,14],[26,11,26,14],[18,11,18,14],[19,11,19,14],[20,11,20,14],[25,11,25,14],[7,9,17,9],[7,16,7,19],[5,0,5,1],[10,11,10,14],[11,11,11,14],[17,11,17,14],[14,11,14,14],[15,11,15,14],[8,11,8,14],[9,11,9,14]]}
[]
["Berechnung","Anzahl",1,2,3,4,5,6,7,8,9,10,11,12,13,14,15,16,17,18,19,20,21,22,23,24,25,26,27,28,29,30,31,32,33,34,35,36,37,38,39,40,41,42,43,44,45,46,47,48,49,50,51,52,53,54,55,56,57,58,59,60]
["Gesamt",{"$f":"Eingabe!C24-3","v":2},{"$f":"SUM(Eingabe!E4:E23)","v":33},{"$f":"SUM(Eingabe!F4:F23)","v":34},{"$f":"SUM(Eingabe!G4:G23)","v":31},{"$f":"SUM(Eingabe!H4:H23)","v":26},{"$f":"SUM(Eingabe!I4:I23)","v":32},{"$f":"SUM(Eingabe!J4:J23)","v":30},{"$f":"SUM(Eingabe!K4:K23)","v":33},{"$f":"SUM(Eingabe!L4:L23)","v":26},{"$f":"SUM(Eingabe!M4:M23)","v":25},{"$f":"SUM(Eingabe!N4:N23)","v":27},{"$f":"SUM(Eingabe!O4:O23)","v":30},{"$f":"SUM(Eingabe!P4:P23)","v":31},{"$f":"SUM(Eingabe!Q4:Q23)","v":30},{"$f":"SUM(Eingabe!R4:R23)","v":32},{"$f":"SUM(Eingabe!S4:S23)","v":30},{"$f":"SUM(Eingabe!T4:T23)","v":0},{"$f":"SUM(Eingabe!U4:U23)","v":0},{"$f":"SUM(Eingabe!V4:V23)","v":0},{"$f":"SUM(Eingabe!W4:W23)","v":0},{"$f":"SUM(Eingabe!X4:X23)","v":0},{"$f":"SUM(Eingabe!Y4:Y23)","v":0},{"$f":"SUM(Eingabe!Z4:Z23)","v":0},{"$f":"SUM(Eingabe!AA4:AA23)","v":0},{"$f":"SUM(Eingabe!AB4:AB23)","v":0},{"$f":"SUM(Eingabe!AC4:AC23)","v":0},{"$f":"SUM(Eingabe!AD4:AD23)","v":0},{"$f":"SUM(Eingabe!AE4:AE23)","v":0},{"$f":"SUM(Eingabe!AF4:AF23)","v":0},{"$f":"SUM(Eingabe!AG4:AG23)","v":0},{"$f":"SUM(Eingabe!AH4:AH23)","v":0},{"$f":"SUM(Eingabe!AI4:AI23)","v":0},{"$f":"SUM(Eingabe!AJ4:AJ23)","v":0},{"$f":"SUM(Eingabe!AK4:AK23)","v":0},{"$f":"SUM(Eingabe!AL4:AL23)","v":0},{"$f":"SUM(Eingabe!AM4:AM23)","v":0},{"$f":"SUM(Eingabe!AN4:AN23)","v":0},{"$f":"SUM(Eingabe!AO4:AO23)","v":0},{"$f":"SUM(Eingabe!AP4:AP23)","v":0},{"$f":"SUM(Eingabe!AQ4:AQ23)","v":0},{"$f":"SUM(Eingabe!AR4:AR23)","v":0},{"$f":"SUM(Eingabe!AS4:AS23)","v":0},{"$f":"SUM(Eingabe!AT4:AT23)","v":0},{"$f":"SUM(Eingabe!AU4:AU23)","v":0},{"$f":"SUM(Eingabe!AV4:AV23)","v":0},{"$f":"SUM(Eingabe!AW4:AW23)","v":0},{"$f":"SUM(Eingabe!AX4:AX23)","v":0},{"$f":"SUM(Eingabe!AY4:AY23)","v":0},{"$f":"SUM(Eingabe!AZ4:AZ23)","v":0},{"$f":"SUM(Eingabe!BA4:BA23)","v":0},{"$f":"SUM(Eingabe!BB4:BB23)","v":0},{"$f":"SUM(Eingabe!BC4:BC23)","v":0},{"$f":"SUM(Eingabe!BD4:BD23)","v":0},{"$f":"SUM(Eingabe!BE4:BE23)","v":0},{"$f":"SUM(Eingabe!BF4:BF23)","v":0},{"$f":"SUM(Eingabe!BG4:BG23)","v":0},{"$f":"SUM(Eingabe!BH4:BH23)","v":0},{"$f":"SUM(Eingabe!BI4:BI23)","v":0},{"$f":"SUM(Eingabe!BJ4:BJ23)","v":0},{"$f":"SUM(Eingabe!BK4:BK23)","v":0},{"$f":"SUM(Eingabe!BL4:BL23)","v":0}]
["Niedrigster Wert",null,{"$f":"IF(C3=0,\"-\",MIN(Eingabe!E4:E23))","v":7},{"$f":"IF(D3=0,\"-\",MIN(Eingabe!F4:F23))","v":7},{"$f":"IF(E3=0,\"-\",MIN(Eingabe!G4:G23))","v":7},{"$f":"IF(F3=0,\"-\",MIN(Eingabe!H4:H23))","v":6},{"$f":"IF(G3=0,\"-\",MIN(Eingabe!I4:I23))","v":7},{"$f":"IF(H3=0,\"-\",MIN(Eingabe!J4:J23))","v":7},{"$f":"IF(I3=0,\"-\",MIN(Eingabe!K4:K23))","v":7},{"$f":"IF(J3=0,\"-\",MIN(Eingabe!L4:L23))","v":6},{"$f":"IF(K3=0,\"-\",MIN(Eingabe!M4:M23))","v":5},{"$f":"IF(L3=0,\"-\",MIN(Eingabe!N4:N23))","v":6},{"$f":"IF(M3=0,\"-\",MIN(Eingabe!O4:O23))","v":7},{"$f":"IF(N3=0,\"-\",MIN(Eingabe!P4:P23))","v":6},{"$f":"IF(O3=0,\"-\",MIN(Eingabe!Q4:Q23))","v":7},{"$f":"IF(P3=0,\"-\",MIN(Eingabe!R4:R23))","v":7},{"$f":"IF(Q3=0,\"-\",MIN(Eingabe!S4:S23))","v":7},{"$f":"IF(R3=0,\"-\",MIN(Eingabe!T4:T23))","v":"-"},{"$f":"IF(S3=0,\"-\",MIN(Eingabe!U4:U23))","v":"-"},{"$f":"IF(T3=0,\"-\",MIN(Eingabe!V4:V23))","v":"-"},{"$f":"IF(U3=0,\"-\",MIN(Eingabe!W4:W23))","v":"-"},{"$f":"IF(V3=0,\"-\",MIN(Eingabe!X4:X23))","v":"-"},{"$f":"IF(W3=0,\"-\",MIN(Eingabe!Y4:Y23))","v":"-"},{"$f":"IF(X3=0,\"-\",MIN(Eingabe!Z4:Z23))","v":"-"},{"$f":"IF(Y3=0,\"-\",MIN(Eingabe!AA4:AA23))","v":"-"},{"$f":"IF(Z3=0,\"-\",MIN(Eingabe!AB4:AB23))","v":"-"},{"$f":"IF(AA3=0,\"-\",MIN(Eingabe!AC4:AC23))","v":"-"},{"$f":"IF(AB3=0,\"-\",MIN(Eingabe!AD4:AD23))","v":"-"},{"$f":"IF(AC3=0,\"-\",MIN(Eingabe!AE4:AE23))","v":"-"},{"$f":"IF(AD3=0,\"-\",MIN(Eingabe!AF4:AF23))","v":"-"},{"$f":"IF(AE3=0,\"-\",MIN(Eingabe!AG4:AG23))","v":"-"},{"$f":"IF(AF3=0,\"-\",MIN(Eingabe!AH4:AH23))","v":"-"},{"$f":"IF(AG3=0,\"-\",MIN(Eingabe!AI4:AI23))","v":"-"},{"$f":"IF(AH3=0,\"-\",MIN(Eingabe!AJ4:AJ23))","v":"-"},{"$f":"IF(AI3=0,\"-\",MIN(Eingabe!AK4:AK23))","v":"-"},{"$f":"IF(AJ3=0,\"-\",MIN(Eingabe!AL4:AL23))","v":"-"},{"$f":"IF(AK3=0,\"-\",MIN(Eingabe!AM4:AM23))","v":"-"},{"$f":"IF(AL3=0,\"-\",MIN(Eingabe!AN4:AN23))","v":"-"},{"$f":"IF(AM3=0,\"-\",MIN(Eingabe!AO4:AO23))","v":"-"},{"$f":"IF(AN3=0,\"-\",MIN(Eingabe!AP4:AP23))","v":"-"},{"$f":"IF(AO3=0,\"-\",MIN(Eingabe!AQ4:AQ23))","v":"-"},{"$f":"IF(AP3=0,\"-\",MIN(Eingabe!AR4:AR23))","v":"-"},{"$f":"IF(AQ3=0,\"-\",MIN(Eingabe!AS4:AS23))","v":"-"},{"$f":"IF(AR3=0,\"-\",MIN(Eingabe!AT4:AT23))","v":"-"},{"$f":"IF(AS3=0,\"-\",MIN(Eingabe!AU4:AU23))","v":"-"},{"$f":"IF(AT3=0,\"-\",MIN(Eingabe!AV4:AV23))","v":"-"},{"$f":"IF(AU3=0,\"-\",MIN(Eingabe!AW4:AW23))","v":"-"},{"$f":"IF(AV3=0,\"-\",MIN(Eingabe!AX4:AX23))","v":"-"},{"$f":"IF(AW3=0,\"-\",MIN(Eingabe!AY4:AY23))","v":"-"},{"$f":"IF(AX3=0,\"-\",MIN(Eingabe!AZ4:AZ23))","v":"-"},{"$f":"IF(AY3=0,\"-\",MIN(Eingabe!BA4:BA23))","v":"-"},{"$f":"IF(AZ3=0,\"-\",MIN(Eingabe!BB4:BB23))","v":"-"},{"$f":"IF(BA3=0,\"-\",MIN(Eingabe!BC4:BC23))","v":"-"},{"$f":"IF(BB3=0,\"-\",MIN(Eingabe!BD4:BD23))","v":"-"},{"$f":"IF(BC3=0,\"-\",MIN(Eingabe!BE4:BE23))","v":"-"},{"$f":"IF(BD3=0,\"-\",MIN(Eingabe!BF4:BF23))","v":"-"},{"$f":"IF(BE3=0,\"-\",MIN(Eingabe!BG4:BG23))","v":"-"},{"$f":"IF(BF3=0,\"-\",MIN(Eingabe!BH4:BH23))","v":"-"},{"$f":"IF(BG3=0,\"-\",MIN(Eingabe!BI4:BI23))","v":"-"},{"$f":"IF(BH3=0,\"-\",MIN(Eingabe!BJ4:BJ23))","v":"-"},{"$f":"IF(BI3=0,\"-\",MIN(Eingabe!BK4:BK23))","v":"-"},{"$f":"IF(BJ3=0,\"-\",MIN(Eingabe!BL4:BL23))","v":"-"}]
["Höchster Wert",null,{"$f":"IF(C3=0,\"-\",MAX(Eingabe!E4:E23))","v":9},{"$f":"IF(D3=0,\"-\",MAX(Eingabe!F4:F23))","v":10},{"$f":"IF(E3=0,\"-\",MAX(Eingabe!G4:G23))","v":9},{"$f":"IF(F3=0,\"-\",MAX(Eingabe!H4:H23))","v":8},{"$f":"IF(G3=0,\"-\",MAX(Eingabe!I4:I23))","v":10},{"$f":"IF(H3=0,\"-\",MAX(Eingabe!J4:J23))","v":8},{"$f":"IF(I3=0,\"-\",MAX(Eingabe!K4:K23))","v":10},{"$f":"IF(J3=0,\"-\",MAX(Eingabe!L4:L23))","v":7},{"$f":"IF(K3=0,\"-\",MAX(Eingabe!M4:M23))","v":7},{"$f":"IF(L3=0,\"-\",MAX(Eingabe!N4:N23))","v":8},{"$f":"IF(M3=0,\"-\",MAX(Eingabe!O4:O23))","v":8},{"$f":"IF(N3=0,\"-\",MAX(Eingabe!P4:P23))","v":10},{"$f":"IF(O3=0,\"-\",MAX(Eingabe!Q4:Q23))","v":9},{"$f":"IF(P3=0,\"-\",MAX(Eingabe!R4:R23))","v":9},{"$f":"IF(Q3=0,\"-\",MAX(Eingabe!S4:S23))","v":8},{"$f":"IF(R3=0,\"-\",MAX(Eingabe!T4:T23))","v":"-"},{"$f":"IF(S3=0,\"-\",MAX(Eingabe!U4:U23))","v":"-"},{"$f":"IF(T3=0,\"-\",MAX(Eingabe!V4:V23))","v":"-"},{"$f":"IF(U3=0,\"-\",MAX(Eingabe!W4:W23))","v":"-"},{"$f":"IF(V3=0,\"-\",MAX(Eingabe!X4:X23))","v":"-"},{"$f":"IF(W3=0,\"-\",MAX(Eingabe!Y4:Y23))","v":"-"},{"$f":"IF(X3=0,\"-\",MAX(Eingabe!Z4:Z23))","v":"-"},{"$f":"IF(Y3=0,\"-\",MAX(Eingabe!AA4:AA23))","v":"-"},{"$f":"IF(Z3=0,\"-\",MAX(Eingabe!AB4:AB23))","v":"-"},{"$f":"IF(AA3=0,\"-\",MAX(Eingabe!AC4:AC23))","v":"-"},{"$f":"IF(AB3=0,\"-\",MAX(Eingabe!AD4:AD23))","v":"-"},{"$f":"IF(AC3=0,\"-\",MAX(Eingabe!AE4:AE23))","v":"-"},{"$f":"IF(AD3=0,\"-\",MAX(Eingabe!AF4:AF23))","v":"-"},{"$f":"IF(AE3=0,\"-\",MAX(Eingabe!AG4:AG23))","v":"-"},{"$f":"IF(AF3=0,\"-\",MAX(Eingabe!AH4:AH23))","v":"-"},{"$f":"IF(AG3=0,\"-\",MAX(Eingabe!AI4:AI23))","v":"-"},{"$f":"IF(AH3=0,\"-\",MAX(Eingabe!AJ4:AJ23))","v":"-"},{"$f":"IF(AI3=0,\"-\",MAX(Eingabe!AK4:AK23))","v":"-"},{"$f":"IF(AJ3=0,\"-\",MAX(Eingabe!AL4:AL23))","v":"-"},{"$f":"IF(AK3=0,\"-\",MAX(Eingabe!AM4:AM23))","v":"-"},{"$f":"IF(AL3=0,\"-\",MAX(Eingabe!AN4:AN23))","v":"-"},{"$f":"IF(AM3=0,\"-\",MAX(Eingabe!AO4:AO23))","v":"-"},{"$f":"IF(AN3=0,\"-\",MAX(Eingabe!AP4:AP23))","v":"-"},{"$f":"IF(AO3=0,\"-\",MAX(Eingabe!AQ4:AQ23))","v":"-"},{"$f":"IF(AP3=0,\"-\",MAX(Eingabe!AR4:AR23))","v":"-"},{"$f":"IF(AQ3=0,\"-\",MAX(Eingabe!AS4:AS23))","v":"-"},{"$f":"IF(AR3=0,\"-\",MAX(Eingabe!AT4:AT23))","v":"-"},{"$f":"IF(AS3=0,\"-\",MAX(Eingabe!AU4:AU23))","v":"-"},{"$f":"IF(AT3=0,\"-\",MAX(Eingabe!AV4:AV23))","v":"-"},{"$f":"IF(AU3=0,\"-\",MAX(Eingabe!AW4:AW23))","v":"-"},{"$f":"IF(AV3=0,\"-\",MAX(Eingabe!AX4:AX23))","v":"-"},{"$f":"IF(AW3=0,\"-\",MAX(Eingabe!AY4:AY23))","v":"-"},{"$f":"IF(AX3=0,\"-\",MAX(Eingabe!AZ4:AZ23))","v":"-"},{"$f":"IF(AY3=0,\"-\",MAX(Eingabe!BA4:BA23))","v":"-"},{"$f":"IF(AZ3=0,\"-\",MAX(Eingabe!BB4:BB23))","v":"-"},{"$f":"IF(BA3=0,\"-\",MAX(Eingabe!BC4:BC23))","v":"-"},{"$f":"IF(BB3=0,\"-\",MAX(Eingabe!BD4:BD23))","v":"-"},{"$f":"IF(BC3=0,\"-\",MAX(Eingabe!BE4:BE23))","v":"-"},{"$f":"IF(BD3=0,\"-\",MAX(Eingabe!BF4:BF23))","v":"-"},{"$f":"IF(BE3=0,\"-\",MAX(Eingabe!BG4:BG23))","v":"-"},{"$f":"IF(BF3=0,\"-\",MAX(Eingabe!BH4:BH23))","v":"-"},{"$f":"IF(BG3=0,\"-\",MAX(Eingabe!BI4:BI23))","v":"-"},{"$f":"IF(BH3=0,\"-\",MAX(Eingabe!BJ4:BJ23))","v":"-"},{"$f":"IF(BI3=0,\"-\",MAX(Eingabe!BK4:BK23))","v":"-"},{"$f":"IF(BJ3=0,\"-\",MAX(Eingabe!BL4:BL23))","v":"-"}]
["Mittelwert",null,{"$f":"IF(C3=0,0,(C3-C4-C5)/$B$3)","v":8.5},{"$f":"IF(D3=0,0,(D3-D4-D5)/$B$3)","v":8.5},{"$f":"IF(E3=0,0,(E3-E4-E5)/$B$3)","v":7.5},{"$f":"IF(F3=0,0,(F3-F4-F5)/$B$3)","v":6},7.5,7.5,8,6.5,6.5,6.5,7.5,7.5,7,8,7.5,0,0,0,0,0,0,0,0,0,0,0,0,0,0,0,0,0,0,0,0,0,0,0,0,0,0,0,0,0,0,0,0,0,{"$f":"IF(AY3=0,0,(AY3-AY4-AY5)/$B$3)","v":0},0,0,0,0,0,0,0,0,0,0,0]
[]
["Sparte","DIE 6 BESTEN BILDER","MW","Z","Foto","Kanditat","MW","Zähler",null,"GESAMTERGEBNIS","Nr.","Kanditat",null,null,null,"GW","Kanditat"]
[3,null,{"$f":"C6","v":8.5},1,1,{"$f":"IF(Output!B10=0,\"\",Output!B10)","v":"Harald Burmann"},{"$f":"C9","v":8.5},1,null,null,1,{"$f":"IF(Eingabe!B4=0,\"\",Eingabe!B4)","v":"Gottfried Weinhäupl"},null,null,null,{"$f":"IF(Eingabe!C4=0,0,SUMIF($F$9:$G$68,L9,$G$9:$G$68))","v":20},{"$f":"L9","v":"Gottfried Weinhäupl"}]
[null,null,{"$f":"D6","v":8.5},1,2,{"$f":"IF(Output!B11=0,\"\",Output!B11)","v":"Tobias Ötzbrugger"},{"$f":"C10","v":8.5},{"$f":"IF(F10=\"\",\"\",SUMIF(F$9:$F10,F10,D$9:$D10))","v":1},null,null,2,{"$f":"IF(Eingabe!B5=0,\"\",Eingabe!B5)","v":"Harald Burmann"},null,null,null,{"$f":"IF(Eingabe!C5=0,0,SUMIF($F$9:$G$68,L10,$G$9:$G$68))","v":24.5},{"$f":"L10","v":"Harald Burmann"}]
["Mitglied",null,{"$f":"E6","v":7.5},1,3,{"$f":"IF(Output!B12=0,\"\",Output!B12)","v":"Günther Schatz"},7.5,{"$f":"IF(F11=\"\",\"\",SUMIF(F$9:$F11,F11,D$9:$D11))","v":1},null,null,3,{"$f":"IF(Eingabe!B6=0,\"\",Eingabe!B6)","v":"Tobias Ötzbrugger"},null,null,null,{"$f":"IF(Eingabe!C6=0,0,SUMIF($F$9:$G$68,L11,$G$9:$G$68))","v":23.5},"Tobias Ötzbrugger"]
[25,null,{"$f":"F6","v":6},1,4,{"$f":"IF(Output!B13=0,\"\",Output!B13)","v":"Gottfried Weinhäupl"},6,{"$f":"IF(F12=\"\",\"\",SUMIF(F$9:$F12,F12,D$9:$D12))","v":1},null,null,4,{"$f":"IF(Eingabe!B7=0,\"\",Eingabe!B7)","v":"Helga Tötsch"},null,null,null,{"$f":"IF(Eingabe!C7=0,,SUMIF($F$9:$G$68,L12,$G$9:$G$68))","v":21.5},"Helga Tötsch"]
[null,null,{"$f":"G6","v":7.5},1,5,{"$f":"IF(Output!B14=0,\"\",Output!B14)","v":"Helga Tötsch"},7.5,{"$f":"IF(F13=\"\",\"\",SUMIF(F$9:$F13,F13,D$9:$D13))","v":1},null,null,5,{"$f":"IF(Eingabe!B8=0,\"\",Eingabe!B8)","v":"Günther Schatz"},null,null,null,{"$f":"IF(Eingabe!C8=0,0,SUMIF($F$9:$G$68,L13,$G$9:$G$68))","v":21},"Günther Schatz"]
[null,null,{"$f":"H6","v":7.5},1,6,{"$f":"IF(Output!B15=0,\"\",Output!B15)","v":"Tobias Ötzbrugger"},7.5,{"$f":"IF(F14=\"\",\"\",SUMIF(F$9:$F14,F14,D$9:$D14))","v":2},null,null,6,{"$f":"IF(Eingabe!B9=0,\"\",Eingabe!B9)","v":""},null,null,null,{"$f":"IF(Eingabe!C9=0,0,SUMIF($F$9:$G$68,L14,$G$9:$G$68))","v":0},""]
[null,null,{"$f":"I6","v":8},1,7,{"$f":"IF(Output!B16=0,\"\",Output!B16)","v":"Harald Burmann"},8,{"$f":"IF(F15=\"\",\"\",SUMIF(F$9:$F15,F15,D$9:$D15))","v":2},null,null,7,{"$f":"IF(Eingabe!B10=0,\"\",Eingabe!B10)","v":""},null,null,null,{"$f":"IF(Eingabe!C10=0,0,SUMIF($F$9:$G$68,L15,$G$9:$G$68))","v":0},""]
[null,null,{"$f":"J6","v":6.5},1,8,{"$f":"IF(Output!B17=0,\"\",Output!B17)","v":"Gottfried Weinhäupl"},6.5,{"$f":"IF(F16=\"\",\"\",SUMIF(F$9:$F16,F16,D$9:$D16))","v":2},null,null,8,{"$f":"IF(Eingabe!B11=0,\"\",Eingabe!B11)","v":""},null,null,null,{"$f":"IF(Eingabe!C11=0,0,SUMIF($F$9:$G$68,L16,$G$9:$G$68))","v":0},""]
[null,null,{"$f":"K6","v":6.5},1,9,{"$f":"IF(Output!B18=0,\"\",Output!B18)","v":"Helga Tötsch"},6.5,{"$f":"IF(F17=\"\",\"\",SUMIF(F$9:$F17,F17,D$9:$D17))","v":2},null,null,9,{"$f":"IF(Eingabe!B12=0,\"\",Eingabe!B12)","v":""},null,null,null,{"$f":"IF(Eingabe!C12=0,0,SUMIF($F$9:$G$68,L17,$G$9:$G$68))","v":0},""]
[null,null,{"$f":"L6","v":6.5},1,10,{"$f":"IF(Output!B19=0,\"\",Output!B19)","v":"Günther Schatz"},6.5,{"$f":"IF(F18=\"\",\"\",SUMIF(F$9:$F18,F18,D$9:$D18))","v":2},null,null,10,{"$f":"IF(Eingabe!B13=0,\"\",Eingabe!B13)","v":""},null,null,null,{"$f":"IF(Eingabe!C13=0,0,SUMIF($F$9:$G$68,L18,$G$9:$G$68))","v":0},""]
[null,null,{"$f":"M6","v":7.5},1,11,{"$f":"IF(Output!B20=0,\"\",Output!B20)","v":"Tobias Ötzbrugger"},7.5,{"$f":"IF(F19=\"\",\"\",SUMIF(F$9:$F19,F19,D$9:$D19))","v":3},null,null,11,{"$f":"IF(Eingabe!B14=0,\"\",Eingabe!B14)","v":""},null,null,null,{"$f":"IF(Eingabe!C14=0,0,SUMIF($F$9:$G$68,L19,$G$9:$G$68))","v":0},""]
[null,null,{"$f":"N6","v":7.5},1,12,{"$f":"IF(Output!B21=0,\"\",Output!B21)","v":"Helga Tötsch"},7.5,{"$f":"IF(F20=\"\",\"\",SUMIF(F$9:$F20,F20,D$9:$D20))","v":3},null,null,12,{"$f":"IF(Eingabe!B15=0,\"\",Eingabe!B15)","v":""},null,null,null,{"$f":"IF(Eingabe!C15=0,0,SUMIF($F$9:$G$68,L20,$G$9:$G$68))","v":0},""]
[null,null,{"$f":"O6","v":7},1,13,{"$f":"IF(Output!B22=0,\"\",Output!B22)","v":"Günther Schatz"},7,{"$f":"IF(F21=\"\",\"\",SUMIF(F$9:$F21,F21,D$9:$D21))","v":3},null,null,13,{"$f":"IF(Eingabe!B16=0,\"\",Eingabe!B16)","v":""},null,null,null,{"$f":"IF(Eingabe!C16=0,0,SUMIF($F$9:$G$68,L21,$G$9:$G$68))","v":0},""]
[null,null,{"$f":"P6","v":8},1,14,{"$f":"IF(Output!B23=0,\"\",Output!B23)","v":"Harald Burmann"},8,{"$f":"IF(F22=\"\",\"\",SUMIF(F$9:$F22,F22,D$9:$D22))","v":3},null,null,14,{"$f":"IF(Eingabe!B17=0,\"\",Eingabe!B17)","v":""},null,null,null,{"$f":"IF(Eingabe!C17=0,0,SUMIF($F$9:$G$68,L22,$G$9:$G$68))","v":0},""]
[null,null,{"$f":"Q6","v":7.5},1,15,{"$f":"IF(Output!B24=0,\"\",Output!B24)","v":"Gottfried Weinhäupl"},7.5,{"$f":"IF(F23=\"\",\"\",SUMIF(F$9:$F23,F23,D$9:$D23))","v":3},null,null,15,{"$f":"IF(Eingabe!B18=0,\"\",Eingabe!B18)","v":""},null,null,null,{"$f":"IF(Eingabe!C18=0,0,SUMIF($F$9:$G$68,L23,$G$9:$G$68))","v":0},""]
[null,null,{"$f":"R6","v":0},1,16,{"$f":"IF(Output!B25=0,\"\",Output!B25)","v":""},0,{"$f":"IF(F24=\"\",\"\",SUMIF(F$9:$F24,F24,D$9:$D24))","v":""},null,null,16,{"$f":"IF(Eingabe!B19=0,\"\",Eingabe!B19)","v":""},null,null,null,{"$f":"IF(Eingabe!C19=0,0,SUMIF($F$9:$G$68,L24,$G$9:$G$68))","v":0},""]
[null,null,{"$f":"S6","v":0},1,17,{"$f":"IF(Output!B26=0,\"\",Output!B26)","v":""},0,{"$f":"IF(F25=\"\",\"\",SUMIF(F$9:$F25,F25,D$9:$D25))","v":""},null,null,17,{"$f":"IF(Eingabe!B20=0,\"\",Eingabe!B20)","v":""},null,null,null,{"$f":"IF(Eingabe!C20=0,0,SUMIF($F$9:$G$68,L25,$G$9:$G$68))","v":0},""]
[null,null,{"$f":"T6","v":0},1,18,{"$f":"IF(Output!B27=0,\"\",Output!B27)","v":""},0,{"$f":"IF(F26=\"\",\"\",SUMIF(F$9:$F26,F26,D$9:$D26))","v":""},null,null,18,{"$f":"IF(Eingabe!B21=0,\"\",Eingabe!B21)","v":""},null,null,null,{"$f":"IF(Eingabe!C21=0,0,SUMIF($F$9:$G$68,L26,$G$9:$G$68))","v":0},""]
[null,null,{"$f":"U6","v":0},1,19,{"$f":"IF(Output!B28=0,\"\",Output!B28)","v":""},0,{"$f":"IF(F27=\"\",\"\",SUMIF(F$9:$F27,F27,D$9:$D27))","v":""},null,null,19,{"$f":"IF(Eingabe!B22=0,\"\",Eingabe!B22)","v":""},null,null,null,{"$f":"IF(Eingabe!C22=0,0,SUMIF($F$9:$G$68,L27,$G$9:$G$68))","v":0},""]
[null,null,{"$f":"V6","v":0},1,20,{"$f":"IF(Output!B29=0,\"\",Output!B29)","v":""},0,{"$f":"IF(F28=\"\",\"\",SUMIF(F$9:$F28,F28,D$9:$D28))","v":""},null,null,20,{"$f":"IF(Eingabe!B23=0,\"\",Eingabe!B23)","v":""},null,null,null,{"$f":"IF(Eingabe!C23=0,0,SUMIF($F$9:$G$68,L28,$G$9:$G$68))","v":0},""]
[null,null,{"$f":"W6","v":0},1,21,{"$f":"IF(Output!B30=0,\"\",Output!B30)","v":""},0,{"$f":"IF(F29=\"\",\"\",SUMIF(F$9:$F29,F29,D$9:$D29))","v":""}]
[null,null,{"$f":"X6","v":0},1,22,{"$f":"IF(Output!B31=0,\"\",Output!B31)","v":""},0,{"$f":"IF(F30=\"\",\"\",SUMIF(F$9:$F30,F30,D$9:$D30))","v":""}]
[null,null,{"$f":"Y6","v":0},1,23,{"$f":"IF(Output!B32=0,\"\",Output!B32)","v":""},0,{"$f":"IF(F31=\"\",\"\",SUMIF(F$9:$F31,F31,D$9:$D31))","v":""}]
[null,null,{"$f":"Z6","v":0},1,24,{"$f":"IF(Output!B33=0,\"\",Output!B33)","v":""},0,{"$f":"IF(F32=\"\",\"\",SUMIF(F$9:$F32,F32,D$9:$D32))","v":""}]
[null,null,{"$f":"AA6","v":0},1,25,{"$f":"IF(Output!B34=0,\"\",Output!B34)","v":""},0,{"$f":"IF(F33=\"\",\"\",SUMIF(F$9:$F33,F33,D$9:$D33))","v":""}]
[null,null,{"$f":"AB6","v":0},1,26,{"$f":"IF(Output!B35=0,\"\",Output!B35)","v":""},0,{"$f":"IF(F34=\"\",\"\",SUMIF(F$9:$F34,F34,D$9:$D34))","v":""}]
[null,null,{"$f":"AC6","v":0},1,27,{"$f":"IF(Output!B36=0,\"\",Output!B36)","v":""},0,{"$f":"IF(F35=\"\",\"\",SUMIF(F$9:$F35,F35,D$9:$D35))","v":""}]
[null,null,{"$f":"AD6","v":0},1,28,{"$f":"IF(Output!B37=0,\"\",Output!B37)","v":""},0,{"$f":"IF(F36=\"\",\"\",SUMIF(F$9:$F36,F36,D$9:$D36))","v":""}]
[null,null,{"$f":"AE6","v":0},1,29,{"$f":"IF(Output!B38=0,\"\",Output!B38)","v":""},0,{"$f":"IF(F37=\"\",\"\",SUMIF(F$9:$F37,F37,D$9:$D37))","v":""}]
[null,null,{"$f":"AF6","v":0},1,30,{"$f":"IF(Output!B39=0,\"\",Output!B39)","v":""},0,{"$f":"IF(F38=\"\",\"\",SUMIF(F$9:$F38,F38,D$9:$D38))","v":""}]
[null,null,{"$f":"AG6","v":0},1,31,{"$f":"IF(Output!B40=0,\"\",Output!B40)","v":""},0,{"$f":"IF(F39=\"\",\"\",SUMIF(F$9:$F39,F39,D$9:$D39))","v":""}]
[null,null,{"$f":"AH6","v":0},1,32,{"$f":"IF(Output!B41=0,\"\",Output!B41)","v":""},{"$f":"C40","v":0},{"$f":"IF(F40=\"\",\"\",SUMIF(F$9:$F40,F40,D$9:$D40))","v":""}]
[null,null,{"$f":"AI6","v":0},1,33,{"$f":"IF(Output!B42=0,\"\",Output!B42)","v":""},0,{"$f":"IF(F41=\"\",\"\",SUMIF(F$9:$F41,F41,D$9:$D41))","v":""}]
[null,null,{"$f":"AJ6","v":0},1,34,{"$f":"IF(Output!B43=0,\"\",Output!B43)","v":""},0,{"$f":"IF(F42=\"\",\"\",SUMIF(F$9:$F42,F42,D$9:$D42))","v":""}]
[null,null,{"$f":"AK6","v":0},1,35,{"$f":"IF(Output!B44=0,\"\",Output!B44)","v":""},0,{"$f":"IF(F43=\"\",\"\",SUMIF(F$9:$F43,F43,D$9:$D43))","v":""}]
[null,null,{"$f":"AL6","v":0},1,36,{"$f":"IF(Output!B45=0,\"\",Output!B45)","v":""},0,{"$f":"IF(F44=\"\",\"\",SUMIF(F$9:$F44,F44,D$9:$D44))","v":""}]
[null,null,{"$f":"AM6","v":0},1,37,{"$f":"IF(Output!B46=0,\"\",Output!B46)","v":""},0,{"$f":"IF(F45=\"\",\"\",SUMIF(F$9:$F45,F45,D$9:$D45))","v":""}]
[null,null,{"$f":"AN6","v":0},1,38,{"$f":"IF(Output!B47=0,\"\",Output!B47)","v":""},0,{"$f":"IF(F46=\"\",\"\",SUMIF(F$9:$F46,F46,D$9:$D46))","v":""}]
[null,null,{"$f":"AO6","v":0},1,39,{"$f":"IF(Output!B48=0,\"\",Output!B48)","v":""},0,{"$f":"IF(F47=\"\",\"\",SUMIF(F$9:$F47,F47,D$9:$D47))","v":""}]
[null,null,{"$f":"AP6","v":0},1,40,{"$f":"IF(Output!B49=0,\"\",Output!B49)","v":""},0,{"$f":"IF(F48=\"\",\"\",SUMIF(F$9:$F48,F48,D$9:$D48))","v":""}]
[null,null,{"$f":"AQ6","v":0},1,41,{"$f":"IF(Output!B50=0,\"\",Output!B50)","v":""},0,{"$f":"IF(F49=\"\",\"\",SUMIF(F$9:$F49,F49,D$9:$D49))","v":""}]
[null,null,{"$f":"AR6","v":0},1,42,{"$f":"IF(Output!B51=0,\"\",Output!B51)","v":""},0,{"$f":"IF(F50=\"\",\"\",SUMIF(F$9:$F50,F50,D$9:$D50))","v":""}]
[null,null,{"$f":"AS6","v":0},1,43,{"$f":"IF(Output!B52=0,\"\",Output!B52)","v":""},0,{"$f":"IF(F51=\"\",\"\",SUMIF(F$9:$F51,F51,D$9:$D51))","v":""}]
[null,null,{"$f":"AT6","v":0},1,44,{"$f":"IF(Output!B53=0,\"\",Output!B53)","v":""},0,{"$f":"IF(F52=\"\",\"\",SUMIF(F$9:$F52,F52,D$9:$D52))","v":""}]
[null,null,{"$f":"AU6","v":0},1,45,{"$f":"IF(Output!B54=0,\"\",Output!B54)","v":""},0,{"$f":"IF(F53=\"\",\"\",SUMIF(F$9:$F53,F53,D$9:$D53))","v":""}]
[null,null,{"$f":"AV6","v":0},1,46,{"$f":"IF(Output!B55=0,\"\",Output!B55)","v":""},0,{"$f":"IF(F54=\"\",\"\",SUMIF(F$9:$F54,F54,D$9:$D54))","v":""}]
[null,null,{"$f":"AW6","v":0},1,47,{"$f":"IF(Output!B56=0,\"\",Output!B56)","v":""},0,{"$f":"IF(F55=\"\",\"\",SUMIF(F$9:$F55,F55,D$9:$D55))","v":""}]
[null,null,{"$f":"AX6","v":0},1,48,{"$f":"IF(Output!B57=0,\"\",Output!B57)","v":""},0,{"$f":"IF(F56=\"\",\"\",SUMIF(F$9:$F56,F56,D$9:$D56))","v":""}]
[null,null,{"$f":"AY6","v":0},1,49,{"$f":"IF(Output!B58=0,\"\",Output!B58)","v":""},0,{"$f":"IF(F57=\"\",\"\",SUMIF(F$9:$F57,F57,D$9:$D57))","v":""}]
[null,null,{"$f":"AZ6","v":0},1,50,{"$f":"IF(Output!B59=0,\"\",Output!B59)","v":""},0,{"$f":"IF(F58=\"\",\"\",SUMIF(F$9:$F58,F58,D$9:$D58))","v":""}]
[null,null,{"$f":"BA6","v":0},1,51,{"$f":"IF(Output!B60=0,\"\",Output!B60)","v":""},0,{"$f":"IF(F59=\"\",\"\",SUMIF(F$9:$F59,F59,D$9:$D59))","v":""}]
[null,null,{"$f":"BB6","v":0},1,52,{"$f":"IF(Output!B61=0,\"\",Output!B61)","v":""},0,{"$f":"IF(F60=\"\",\"\",SUMIF(F$9:$F60,F60,D$9:$D60))","v":""}]
[null,null,{"$f":"BC6","v":0},1,53,{"$f":"IF(Output!B62=0,\"\",Output!B62)","v":""},0,{"$f":"IF(F61=\"\",\"\",SUMIF(F$9:$F61,F61,D$9:$D61))","v":""}]
[null,null,{"$f":"BD6","v":0},1,54,{"$f":"IF(Output!B63=0,\"\",Output!B63)","v":""},0,{"$f":"IF(F62=\"\",\"\",SUMIF(F$9:$F62,F62,D$9:$D62))","v":""}]
[null,null,{"$f":"BE6","v":0},1,55,{"$f":"IF(Output!B64=0,\"\",Output!B64)","v":""},0,{"$f":"IF(F63=\"\",\"\",SUMIF(F$9:$F63,F63,D$9:$D63))","v":""}]
[null,null,{"$f":"BF6","v":0},1,56,{"$f":"IF(Output!B65=0,\"\",Output!B65)","v":""},0,{"$f":"IF(F64=\"\",\"\",SUMIF(F$9:$F64,F64,D$9:$D64))","v":""}]
[null,null,{"$f":"BG6","v":0},1,57,{"$f":"IF(Output!B66=0,\"\",Output!B66)","v":""},0,{"$f":"IF(F65=\"\",\"\",SUMIF(F$9:$F65,F65,D$9:$D65))","v":""}]
[null,null,{"$f":"BH6","v":0},1,58,{"$f":"IF(Output!B67=0,\"\",Output!B67)","v":""},0,{"$f":"IF(F66=\"\",\"\",SUMIF(F$9:$F66,F66,D$9:$D66))","v":""}]
[null,null,{"$f":"BI6","v":0},1,59,{"$f":"IF(Output!B68=0,\"\",Output!B68)","v":""},0,{"$f":"IF(F67=\"\",\"\",SUMIF(F$9:$F67,F67,D$9:$D67))","v":""}]
[null,null,{"$f":"BJ6","v":0},1,60,{"$f":"IF(Output!B69=0,\"\",Output!B69)","v":""},0,{"$f":"IF(F68=\"\",\"\",SUMIF(F$9:$F68,F68,D$9:$D68))","v":""}]

{"sheet":"Output","index":3,"n_rows":69,"n_cols":13,"rows_kept":69,"cut":false,"hidden":false,"merged":[[4,0,5,5],[1,0,1,5],[19,11,20,11],[19,12,20,12],[17,7,18,7],[17,8,18,8],[19,7,20,7],[19,8,20,8],[19,9,20,9],[19,10,20,10],[11,7,12,7],[11,8,12,8],[11,9,12,9],[11,10,12,10],[11,11,12,11],[11,12,12,12],[9,7,10,7],[9,8,10,8],[15,7,16,7],[15,8,16,8],[15,9,16,9],[15,10,16,10],[13,7,14,7],[13,8,14,8],[13,9,14,9],[13,10,14,10],[13,11,14,11],[13,12,14,12],[15,11,16,11],[15,12,16,12],[9,9,10,9],[9,10,10,10],[61,11,62,11],[61,12,62,12],[57,11,58,11],[57,12,58,12],[59,11,60,11],[59,12,60,12],[53,11,54,11],[53,12,54,12],[9,11,10,11],[9,12,10,12],[17,9,18,9],[17,10,18,10],[17,11,18,11],[17,12,18,12],[55,11,56,11],[55,12,56,12],[63,12,64,12],[61,7,62,7],[61,8,62,8],[61,9,62,9],[61,10,62,10],[63,7,64,7],[63,8,64,8],[63,9,64,9],[63,10,64,10],[59,7,60,7],[59,8,60,8],[59,9,60,9],[59,10,60,10],[57,7,58,7],[57,8,58,8],[57,9,58,9],[57,10,58,10],[63,11,64,11],[53,7,54,7],[53,8,54,8],[53,9,54,9],[53,10,54,10],[55,7,56,7],[55,8,56,8],[55,9,56,9],[55,10,56,10],[45,12,46,12],[47,11,48,11],[47,12,48,12],[49,11,50,11],[49,12,50,12],[51,11,52,11],[51,12,52,12],[49,7,50,7],[49,8,50,8],[51,7,52,7],[51,8,52,8],[51,9,52,9],[51,10,52,10],[49,9,50,9],[49,10,50,10],[47,7,48,7],[47,8,48,8],[47,9,48,9],[47,10,48,10],[45,7,46,7],[45,8,46,8],[45,9,46,9],[45,10,46,10],[45,11,46,11],[37,12,38,12],[39,11,40,11],[39,12,40,12],[41,11,42,11],[41,12,42,12],[43,11,44,11],[43,12,44,12],[41,7,42,7],[41,8,42,8],[43,7,44,7],[43,8,44,8],[43,9,44,9],[43,10,44,10],[41,9,42,9],[41,10,42,10],[39,7,40,7],[39,8,40,8],[39,9,40,9],[39,10,40,10],[37,7,38,7],[37,8,38,8],[37,9,38,9],[37,10,38,10],[37,11,38,11],[29,12,30,12],[31,11,32,11],[31,12,32,12],[33,11,34,11],[33,12,34,12],[35,11,36,11],[35,12,36,12],[33,7,34,7],[33,8,34,8],[35,7,36,7],[35,8,36,8],[35,9,36,9],[35,10,36,10],[33,9,34,9],[33,10,34,10],[31,7,32,7],[31,8,32,8],[31,9,32,9],[31,10,32,10],[29,7,30,7],[29,8,30,8],[29,9,30,9],[29,10,30,10],[29,11,30,11],[25,11,26,11],[25,12,26,12],[27,11,28,11],[27,12,28,12],[27,9,28,9],[27,10,28,10],[25,9,26,9],[25,10,26,10],[25,7,26,7],[25,8,26,8],[27,7,28,7],[27,8,28,8]]}
["Teilnehmer",null,null,null,null,null,null,null,"Sparte"]
[{"$f":"+VLOOKUP(Berechnung!A12,Start!A5:B29,2,FALSE)","v":"Homepage"},null,null,null,null,null,null,null,{"$f":"IF(Berechnung!A9=1,\"Schwarz/Weiß-Bild\",IF(Berechnung!A9=2,\"Farbbild\",IF(Berechnung!A9=3,\"Projektionsbild\",\"FEHLER\")))","v":"Projektionsbild"}]
[]
["Thema:",null,null,null,null,null,null,null,"Datum "]
[{"$f":"Start!F11","v":"FREI"},null,null,null,null,null,null,null,{"$f":"Start!F9","v":"2023-10-10"}]
[null,null,null,null,null,null,null,null,null,null,null,null,"Erlerstraße 2, 6060 Hall i.T."]
[]
[">>> EINZELWERTUNG",null,null,null,null,null,null,">>> DIE 6 BESTEN BILDER"]
["Foto","Kanditat","Niederster\nWert","Höchster\nWert","Mittel-\nwert","eigene\nWertung",null,"Platz","Kanditat","Niederster\nWert","Höchster\nWert","Mittel-\nwert","Bild\nNummer"]
[1,{"$f":"IF(Eingabe!E4=0,\"\",+VLOOKUP(\"x\",Eingabe!E4:$BM$23,61,FALSE))","v":"Harald Burmann"},{"$f":"IF(HLOOKUP(A10,Berechnung!$C$2:$BJ$6,3,FALSE)=0,\"\",HLOOKUP(A10,Berechnung!$C$2:$BJ$6,3,FALSE))","v":7},{"$f":"IF(HLOOKUP(A10,Berechnung!$C$2:$BJ$6,4,FALSE)=0,\"\",HLOOKUP(A10,Berechnung!$C$2:$BJ$6,4,FALSE))","v":9},{"$f":"IF(HLOOKUP(A10,Berechnung!$C$2:$BJ$6,5,FALSE)=0,\"\",HLOOKUP(A10,Berechnung!$C$2:$BJ$6,5,FALSE))","v":8.5},9,null,1,{"$f":"IF(ZW!D3=0,\"\",ZW!D3)","v":"Harald Burmann"},{"$f":"HLOOKUP($M10,Berechnung!$C$2:$BJ$6,3,FALSE)","v":7},{"$f":"HLOOKUP($M10,Berechnung!$C$2:$BJ$6,4,FALSE)","v":9},{"$f":"LARGE(Berechnung!$C$9:$C$68,1)","v":8.5},{"$f":"IF(I10=0,\"\",ZW!C3)","v":1}]
[2,{"$f":"IF(Eingabe!F4=0,\"\",+VLOOKUP(\"x\",Eingabe!F4:$BM$23,60,FALSE))","v":"Tobias Ötzbrugger"},{"$f":"IF(HLOOKUP(A11,Berechnung!$C$2:$BJ$6,3,FALSE)=0,\"\",HLOOKUP(A11,Berechnung!$C$2:$BJ$6,3,FALSE))","v":7},{"$f":"IF(HLOOKUP(A11,Berechnung!$C$2:$BJ$6,4,FALSE)=0,\"\",HLOOKUP(A11,Berechnung!$C$2:$BJ$6,4,FALSE))","v":10},{"$f":"IF(HLOOKUP(A11,Berechnung!$C$2:$BJ$6,5,FALSE)=0,\"\",HLOOKUP(A11,Berechnung!$C$2:$BJ$6,5,FALSE))","v":8.5},10,null,2]
[3,{"$f":"IF(Eingabe!G4=0,\"\",+VLOOKUP(\"x\",Eingabe!G4:BM23,59,FALSE))","v":"Günther Schatz"},{"$f":"IF(HLOOKUP(A12,Berechnung!$C$2:$BJ$6,3,FALSE)=0,\"\",HLOOKUP(A12,Berechnung!$C$2:$BJ$6,3,FALSE))","v":7},{"$f":"IF(HLOOKUP(A12,Berechnung!$C$2:$BJ$6,4,FALSE)=0,\"\",HLOOKUP(A12,Berechnung!$C$2:$BJ$6,4,FALSE))","v":9},{"$f":"IF(HLOOKUP(A12,Berechnung!$C$2:$BJ$6,5,FALSE)=0,\"\",HLOOKUP(A12,Berechnung!$C$2:$BJ$6,5,FALSE))","v":7.5},"x",null,{"$f":"IF(L12=L10,\"\",2)","v":""},{"$f":"IF(ZW!D4=0,\"\",ZW!D4)","v":"Tobias Ötzbrugger"},{"$f":"HLOOKUP($M12,Berechnung!$C$2:$BJ$6,3,FALSE)","v":7},{"$f":"HLOOKUP($M12,Berechnung!$C$2:$BJ$6,4,FALSE)","v":10},{"$f":"LARGE(Berechnung!$C$9:$C$68,2)","v":8.5},{"$f":"IF(I12=0,\"\",ZW!C4)","v":2}]
[4,{"$f":"IF(Eingabe!H$4=0,\"\",+VLOOKUP(\"x\",Eingabe!H$4:$BM$23,58,FALSE))","v":"Gottfried Weinhäupl"},{"$f":"IF(HLOOKUP(A13,Berechnung!$C$2:$BJ$6,3,FALSE)=0,\"\",HLOOKUP(A13,Berechnung!$C$2:$BJ$6,3,FALSE))","v":6},{"$f":"IF(HLOOKUP(A13,Berechnung!$C$2:$BJ$6,4,FALSE)=0,\"\",HLOOKUP(A13,Berechnung!$C$2:$BJ$6,4,FALSE))","v":8},{"$f":"IF(HLOOKUP(A13,Berechnung!$C$2:$BJ$6,5,FALSE)=0,\"\",HLOOKUP(A13,Berechnung!$C$2:$BJ$6,5,FALSE))","v":6},6,null,4]
[5,{"$f":"IF(Eingabe!I4=0,\"\",+VLOOKUP(\"x\",Eingabe!I4:$BM$23,57,FALSE))","v":"Helga Tötsch"},{"$f":"IF(HLOOKUP(A14,Berechnung!$C$2:$BJ$6,3,FALSE)=0,\"\",HLOOKUP(A14,Berechnung!$C$2:$BJ$6,3,FALSE))","v":7},{"$f":"IF(HLOOKUP(A14,Berechnung!$C$2:$BJ$6,4,FALSE)=0,\"\",HLOOKUP(A14,Berechnung!$C$2:$BJ$6,4,FALSE))","v":10},{"$f":"IF(HLOOKUP(A14,Berechnung!$C$2:$BJ$6,5,FALSE)=0,\"\",HLOOKUP(A14,Berechnung!$C$2:$BJ$6,5,FALSE))","v":7.5},10,null,{"$f":"IF(L14=L12,\"\",3)","v":3},{"$f":"IF(ZW!D5=0,\"\",ZW!D5)","v":"Harald Burmann"},{"$f":"HLOOKUP($M14,Berechnung!$C$2:$BJ$6,3,FALSE)","v":7},{"$f":"HLOOKUP($M14,Berechnung!$C$2:$BJ$6,4,FALSE)","v":10},{"$f":"LARGE(Berechnung!$C$9:$C$68,3)","v":8},{"$f":"IF(I14=0,\"\",ZW!C5)","v":7}]
[6,{"$f":"IF(Eingabe!J$4=0,\"\",+VLOOKUP(\"x\",Eingabe!J$4:$BM$23,56,FALSE))","v":"Tobias Ötzbrugger"},{"$f":"IF(HLOOKUP(A15,Berechnung!$C$2:$BJ$6,3,FALSE)=0,\"\",HLOOKUP(A15,Berechnung!$C$2:$BJ$6,3,FALSE))","v":7},{"$f":"IF(HLOOKUP(A15,Berechnung!$C$2:$BJ$6,4,FALSE)=0,\"\",HLOOKUP(A15,Berechnung!$C$2:$BJ$6,4,FALSE))","v":8},{"$f":"IF(HLOOKUP(A15,Berechnung!$C$2:$BJ$6,5,FALSE)=0,\"\",HLOOKUP(A15,Berechnung!$C$2:$BJ$6,5,FALSE))","v":7.5},8,null,6]
[7,{"$f":"IF(Eingabe!K$4=0,\"\",+VLOOKUP(\"x\",Eingabe!K$4:$BM$23,55,FALSE))","v":"Harald Burmann"},{"$f":"IF(HLOOKUP(A16,Berechnung!$C$2:$BJ$6,3,FALSE)=0,\"\",HLOOKUP(A16,Berechnung!$C$2:$BJ$6,3,FALSE))","v":7},{"$f":"IF(HLOOKUP(A16,Berechnung!$C$2:$BJ$6,4,FALSE)=0,\"\",HLOOKUP(A16,Berechnung!$C$2:$BJ$6,4,FALSE))","v":10},{"$f":"IF(HLOOKUP(A16,Berechnung!$C$2:$BJ$6,5,FALSE)=0,\"\",HLOOKUP(A16,Berechnung!$C$2:$BJ$6,5,FALSE))","v":8},10,null,{"$f":"IF(L16=L14,\"\",4)","v":""},{"$f":"IF(ZW!D6=0,\"\",ZW!D6)","v":"Harald Burmann"},{"$f":"HLOOKUP($M16,Berechnung!$C$2:$BJ$6,3,FALSE)","v":7},{"$f":"HLOOKUP($M16,Berechnung!$C$2:$BJ$6,4,FALSE)","v":9},{"$f":"LARGE(Berechnung!$C$9:$C$68,4)","v":8},{"$f":"IF(I16=0,\"\",ZW!C6)","v":14}]
[8,{"$f":"IF(Eingabe!L$4=0,\"\",+VLOOKUP(\"x\",Eingabe!L$4:$BM$23,54,FALSE))","v":"Gottfried Weinhäupl"},{"$f":"IF(HLOOKUP(A17,Berechnung!$C$2:$BJ$6,3,FALSE)=0,\"\",HLOOKUP(A17,Berechnung!$C$2:$BJ$6,3,FALSE))","v":6},{"$f":"IF(HLOOKUP(A17,Berechnung!$C$2:$BJ$6,4,FALSE)=0,\"\",HLOOKUP(A17,Berechnung!$C$2:$BJ$6,4,FALSE))","v":7},{"$f":"IF(HLOOKUP(A17,Berechnung!$C$2:$BJ$6,5,FALSE)=0,\"\",HLOOKUP(A17,Berechnung!$C$2:$BJ$6,5,FALSE))","v":6.5},6]
[9,{"$f":"IF(Eingabe!M$4=0,\"\",+VLOOKUP(\"x\",Eingabe!M$4:$BM$23,53,FALSE))","v":"Helga Tötsch"},{"$f":"IF(HLOOKUP(A18,Berechnung!$C$2:$BJ$6,3,FALSE)=0,\"\",HLOOKUP(A18,Berechnung!$C$2:$BJ$6,3,FALSE))","v":5},{"$f":"IF(HLOOKUP(A18,Berechnung!$C$2:$BJ$6,4,FALSE)=0,\"\",HLOOKUP(A18,Berechnung!$C$2:$BJ$6,4,FALSE))","v":7},{"$f":"IF(HLOOKUP(A18,Berechnung!$C$2:$BJ$6,5,FALSE)=0,\"\",HLOOKUP(A18,Berechnung!$C$2:$BJ$6,5,FALSE))","v":6.5},7,null,{"$f":"IF(L18=L16,\"\",5)","v":5},{"$f":"IF(ZW!D7=0,\"\",ZW!D7)","v":"Günther Schatz"},{"$f":"HLOOKUP($M18,Berechnung!$C$2:$BJ$6,3,FALSE)","v":7},{"$f":"HLOOKUP($M18,Berechnung!$C$2:$BJ$6,4,FALSE)","v":9},{"$f":"LARGE(Berechnung!$C$9:$C$68,5)","v":7.5},{"$f":"IF(I18=0,\"\",ZW!C7)","v":3}]
[10,{"$f":"IF(Eingabe!N$4=0,\"\",+VLOOKUP(\"x\",Eingabe!N$4:$BM$23,52,FALSE))","v":"Günther Schatz"},{"$f":"IF(HLOOKUP(A19,Berechnung!$C$2:$BJ$6,3,FALSE)=0,\"\",HLOOKUP(A19,Berechnung!$C$2:$BJ$6,3,FALSE))","v":6},{"$f":"IF(HLOOKUP(A19,Berechnung!$C$2:$BJ$6,4,FALSE)=0,\"\",HLOOKUP(A19,Berechnung!$C$2:$BJ$6,4,FALSE))","v":8},{"$f":"IF(HLOOKUP(A19,Berechnung!$C$2:$BJ$6,5,FALSE)=0,\"\",HLOOKUP(A19,Berechnung!$C$2:$BJ$6,5,FALSE))","v":6.5},"x"]
[11,{"$f":"IF(Eingabe!O$4=0,\"\",+VLOOKUP(\"x\",Eingabe!O$4:$BM$23,51,FALSE))","v":"Tobias Ötzbrugger"},{"$f":"IF(HLOOKUP(A20,Berechnung!$C$2:$BJ$6,3,FALSE)=0,\"\",HLOOKUP(A20,Berechnung!$C$2:$BJ$6,3,FALSE))","v":7},{"$f":"IF(HLOOKUP(A20,Berechnung!$C$2:$BJ$6,4,FALSE)=0,\"\",HLOOKUP(A20,Berechnung!$C$2:$BJ$6,4,FALSE))","v":8},{"$f":"IF(HLOOKUP(A20,Berechnung!$C$2:$BJ$6,5,FALSE)=0,\"\",HLOOKUP(A20,Berechnung!$C$2:$BJ$6,5,FALSE))","v":7.5},8,null,{"$f":"IF(L20=L18,\"\",6)","v":""},{"$f":"IF(ZW!D8=0,\"\",ZW!D8)","v":"Helga Tötsch"},{"$f":"HLOOKUP($M20,Berechnung!$C$2:$BJ$6,3,FALSE)","v":7},{"$f":"HLOOKUP($M20,Berechnung!$C$2:$BJ$6,4,FALSE)","v":10},{"$f":"LARGE(Berechnung!$C$9:$C$68,6)","v":7.5},{"$f":"IF(I20=0,\"\",ZW!C8)","v":5}]
[12,{"$f":"IF(Eingabe!P$4=0,\"\",+VLOOKUP(\"x\",Eingabe!P$4:$BM$23,50,FALSE))","v":"Helga Tötsch"},{"$f":"IF(HLOOKUP(A21,Berechnung!$C$2:$BJ$6,3,FALSE)=0,\"\",HLOOKUP(A21,Berechnung!$C$2:$BJ$6,3,FALSE))","v":6},{"$f":"IF(HLOOKUP(A21,Berechnung!$C$2:$BJ$6,4,FALSE)=0,\"\",HLOOKUP(A21,Berechnung!$C$2:$BJ$6,4,FALSE))","v":10},{"$f":"IF(HLOOKUP(A21,Berechnung!$C$2:$BJ$6,5,FALSE)=0,\"\",HLOOKUP(A21,Berechnung!$C$2:$BJ$6,5,FALSE))","v":7.5},7]
[13,{"$f":"IF(Eingabe!Q$4=0,\"\",+VLOOKUP(\"x\",Eingabe!Q$4:$BM$23,49,FALSE))","v":"Günther Schatz"},{"$f":"IF(HLOOKUP(A22,Berechnung!$C$2:$BJ$6,3,FALSE)=0,\"\",HLOOKUP(A22,Berechnung!$C$2:$BJ$6,3,FALSE))","v":7},{"$f":"IF(HLOOKUP(A22,Berechnung!$C$2:$BJ$6,4,FALSE)=0,\"\",HLOOKUP(A22,Berechnung!$C$2:$BJ$6,4,FALSE))","v":9},{"$f":"IF(HLOOKUP(A22,Berechnung!$C$2:$BJ$6,5,FALSE)=0,\"\",HLOOKUP(A22,Berechnung!$C$2:$BJ$6,5,FALSE))","v":7},"x"]
[14,{"$f":"IF(Eingabe!R$4=0,\"\",+VLOOKUP(\"x\",Eingabe!R$4:$BM$23,48,FALSE))","v":"Harald Burmann"},{"$f":"IF(HLOOKUP(A23,Berechnung!$C$2:$BJ$6,3,FALSE)=0,\"\",HLOOKUP(A23,Berechnung!$C$2:$BJ$6,3,FALSE))","v":7},{"$f":"IF(HLOOKUP(A23,Berechnung!$C$2:$BJ$6,4,FALSE)=0,\"\",HLOOKUP(A23,Berechnung!$C$2:$BJ$6,4,FALSE))","v":9},{"$f":"IF(HLOOKUP(A23,Berechnung!$C$2:$BJ$6,5,FALSE)=0,\"\",HLOOKUP(A23,Berechnung!$C$2:$BJ$6,5,FALSE))","v":8},9]
[15,{"$f":"IF(Eingabe!S$4=0,\"\",+VLOOKUP(\"x\",Eingabe!S$4:$BM$23,47,FALSE))","v":"Gottfried Weinhäupl"},{"$f":"IF(HLOOKUP(A24,Berechnung!$C$2:$BJ$6,3,FALSE)=0,\"\",HLOOKUP(A24,Berechnung!$C$2:$BJ$6,3,FALSE))","v":7},{"$f":"IF(HLOOKUP(A24,Berechnung!$C$2:$BJ$6,4,FALSE)=0,\"\",HLOOKUP(A24,Berechnung!$C$2:$BJ$6,4,FALSE))","v":8},{"$f":"IF(HLOOKUP(A24,Berechnung!$C$2:$BJ$6,5,FALSE)=0,\"\",HLOOKUP(A24,Berechnung!$C$2:$BJ$6,5,FALSE))","v":7.5},7,null,">>> GESAMTERGEBNIS"]
[16,{"$f":"IF(Eingabe!T$4=0,\"\",+VLOOKUP(\"x\",Eingabe!T$4:$BM$23,46,FALSE))","v":""},{"$f":"IF(HLOOKUP(A25,Berechnung!$C$2:$BJ$6,3,FALSE)=0,\"\",HLOOKUP(A25,Berechnung!$C$2:$BJ$6,3,FALSE))","v":"-"},{"$f":"IF(HLOOKUP(A25,Berechnung!$C$2:$BJ$6,4,FALSE)=0,\"\",HLOOKUP(A25,Berechnung!$C$2:$BJ$6,4,FALSE))","v":"-"},{"$f":"IF(HLOOKUP(A25,Berechnung!$C$2:$BJ$6,5,FALSE)=0,\"\",HLOOKUP(A25,Berechnung!$C$2:$BJ$6,5,FALSE))","v":""},0,null,"Platz","Kanditat","Gesamt","Bild 1","Bild 2","Bild 3"]
[17,{"$f":"IF(Eingabe!U$4=0,\"\",+VLOOKUP(\"x\",Eingabe!U$4:$BM$23,45,FALSE))","v":""},{"$f":"IF(HLOOKUP(A26,Berechnung!$C$2:$BJ$6,3,FALSE)=0,\"\",HLOOKUP(A26,Berechnung!$C$2:$BJ$6,3,FALSE))","v":"-"},{"$f":"IF(HLOOKUP(A26,Berechnung!$C$2:$BJ$6,4,FALSE)=0,\"\",HLOOKUP(A26,Berechnung!$C$2:$BJ$6,4,FALSE))","v":"-"},{"$f":"IF(HLOOKUP(A26,Berechnung!$C$2:$BJ$6,5,FALSE)=0,\"\",HLOOKUP(A26,Berechnung!$C$2:$BJ$6,5,FALSE))","v":""},0,null,{"$f":"IF(J26=0,\"\",1)","v":1},{"$f":"IF(Eingabe!B4=0,\"\",WW!$B$3)","v":"Harald Burmann"},{"$f":"IF(Eingabe!B4=0,0,WW!$A$3)","v":24.5},{"$f":"IF(J26=0,\"\",+VLOOKUP(I26,PV!$5:$40,2,FALSE))","v":8.5},{"$f":"IF(J26=0,\"\",+VLOOKUP(I26,PV!$5:$40,3,FALSE))","v":8},{"$f":"IF(J26=0,\"\",+VLOOKUP(I26,PV!$5:$40,4,FALSE))","v":8}]
[18,{"$f":"IF(Eingabe!V$4=0,\"\",+VLOOKUP(\"x\",Eingabe!V$4:$BM$23,44,FALSE))","v":""},{"$f":"IF(HLOOKUP(A27,Berechnung!$C$2:$BJ$6,3,FALSE)=0,\"\",HLOOKUP(A27,Berechnung!$C$2:$BJ$6,3,FALSE))","v":"-"},{"$f":"IF(HLOOKUP(A27,Berechnung!$C$2:$BJ$6,4,FALSE)=0,\"\",HLOOKUP(A27,Berechnung!$C$2:$BJ$6,4,FALSE))","v":"-"},{"$f":"IF(HLOOKUP(A27,Berechnung!$C$2:$BJ$6,5,FALSE)=0,\"\",HLOOKUP(A27,Berechnung!$C$2:$BJ$6,5,FALSE))","v":""},0]
[19,{"$f":"IF(Eingabe!W$4=0,\"\",+VLOOKUP(\"x\",Eingabe!W$4:$BM$23,43,FALSE))","v":""},{"$f":"IF(HLOOKUP(A28,Berechnung!$C$2:$BJ$6,3,FALSE)=0,\"\",HLOOKUP(A28,Berechnung!$C$2:$BJ$6,3,FALSE))","v":"-"},{"$f":"IF(HLOOKUP(A28,Berechnung!$C$2:$BJ$6,4,FALSE)=0,\"\",HLOOKUP(A28,Berechnung!$C$2:$BJ$6,4,FALSE))","v":"-"},{"$f":"IF(HLOOKUP(A28,Berechnung!$C$2:$BJ$6,5,FALSE)=0,\"\",HLOOKUP(A28,Berechnung!$C$2:$BJ$6,5,FALSE))","v":""},0,null,{"$f":"IF(J28=0,\"\",IF(J28=J26,H26,2))","v":2},{"$f":"IF(Eingabe!B5=0,\"\",WW!$B$4)","v":"Tobias Ötzbrugger"},{"$f":"IF(Eingabe!B5=0,0,WW!$A$4)","v":23.5},{"$f":"IF(J28=0,\"\",+VLOOKUP(I28,PV!$5:$40,2,FALSE))","v":8.5},{"$f":"IF(J28=0,\"\",+VLOOKUP(I28,PV!$5:$40,3,FALSE))","v":7.5},{"$f":"IF(J28=0,\"\",+VLOOKUP(I28,PV!$5:$40,4,FALSE))","v":7.5}]
[20,{"$f":"IF(Eingabe!X$4=0,\"\",+VLOOKUP(\"x\",Eingabe!X$4:$BM$23,42,FALSE))","v":""},{"$f":"IF(HLOOKUP(A29,Berechnung!$C$2:$BJ$6,3,FALSE)=0,\"\",HLOOKUP(A29,Berechnung!$C$2:$BJ$6,3,FALSE))","v":"-"},{"$f":"IF(HLOOKUP(A29,Berechnung!$C$2:$BJ$6,4,FALSE)=0,\"\",HLOOKUP(A29,Berechnung!$C$2:$BJ$6,4,FALSE))","v":"-"},{"$f":"IF(HLOOKUP(A29,Berechnung!$C$2:$BJ$6,5,FALSE)=0,\"\",HLOOKUP(A29,Berechnung!$C$2:$BJ$6,5,FALSE))","v":""},0]
[21,{"$f":"IF(Eingabe!Y$4=0,\"\",+VLOOKUP(\"x\",Eingabe!Y$4:$BM$23,41,FALSE))","v":""},{"$f":"IF(HLOOKUP(A30,Berechnung!$C$2:$BJ$6,3,FALSE)=0,\"\",HLOOKUP(A30,Berechnung!$C$2:$BJ$6,3,FALSE))","v":"-"},{"$f":"IF(HLOOKUP(A30,Berechnung!$C$2:$BJ$6,4,FALSE)=0,\"\",HLOOKUP(A30,Berechnung!$C$2:$BJ$6,4,FALSE))","v":"-"},{"$f":"IF(HLOOKUP(A30,Berechnung!$C$2:$BJ$6,5,FALSE)=0,\"\",HLOOKUP(A30,Berechnung!$C$2:$BJ$6,5,FALSE))","v":""},0,null,{"$f":"IF(J30=0,\"\",IF(J30=J28,H28,3))","v":3},{"$f":"IF(Eingabe!B6=0,\"\",WW!$B$5)","v":"Helga Tötsch"},{"$f":"IF(Eingabe!B6=0,0,WW!$A$5)","v":21.5},{"$f":"IF(J30=0,\"\",+VLOOKUP(I30,PV!$5:$40,2,FALSE))","v":7.5},{"$f":"IF(J30=0,\"\",+VLOOKUP(I30,PV!$5:$40,3,FALSE))","v":6.5},{"$f":"IF(J30=0,\"\",+VLOOKUP(I30,PV!$5:$40,4,FALSE))","v":7.5}]
[22,{"$f":"IF(Eingabe!Z$4=0,\"\",+VLOOKUP(\"x\",Eingabe!Z$4:$BM$23,40,FALSE))","v":""},{"$f":"IF(HLOOKUP(A31,Berechnung!$C$2:$BJ$6,3,FALSE)=0,\"\",HLOOKUP(A31,Berechnung!$C$2:$BJ$6,3,FALSE))","v":"-"},{"$f":"IF(HLOOKUP(A31,Berechnung!$C$2:$BJ$6,4,FALSE)=0,\"\",HLOOKUP(A31,Berechnung!$C$2:$BJ$6,4,FALSE))","v":"-"},{"$f":"IF(HLOOKUP(A31,Berechnung!$C$2:$BJ$6,5,FALSE)=0,\"\",HLOOKUP(A31,Berechnung!$C$2:$BJ$6,5,FALSE))","v":""},0]
[23,{"$f":"IF(Eingabe!AA$4=0,\"\",+VLOOKUP(\"x\",Eingabe!AA$4:$BM$23,39,FALSE))","v":""},{"$f":"IF(HLOOKUP(A32,Berechnung!$C$2:$BJ$6,3,FALSE)=0,\"\",HLOOKUP(A32,Berechnung!$C$2:$BJ$6,3,FALSE))","v":"-"},{"$f":"IF(HLOOKUP(A32,Berechnung!$C$2:$BJ$6,4,FALSE)=0,\"\",HLOOKUP(A32,Berechnung!$C$2:$BJ$6,4,FALSE))","v":"-"},{"$f":"IF(HLOOKUP(A32,Berechnung!$C$2:$BJ$6,5,FALSE)=0,\"\",HLOOKUP(A32,Berechnung!$C$2:$BJ$6,5,FALSE))","v":""},0,null,{"$f":"IF(J32=0,\"\",IF(J32=J30,H30,4))","v":4},{"$f":"IF(Eingabe!B7=0,\"\",WW!$B$6)","v":"Günther Schatz"},{"$f":"IF(Eingabe!B7=0,0,WW!$A$6)","v":21},{"$f":"IF(J32=0,\"\",+VLOOKUP(I32,PV!$5:$40,2,FALSE))","v":7.5},{"$f":"IF(J32=0,\"\",+VLOOKUP(I32,PV!$5:$40,3,FALSE))","v":6.5},{"$f":"IF(J32=0,\"\",+VLOOKUP(I32,PV!$5:$40,4,FALSE))","v":7}]
[24,{"$f":"IF(Eingabe!AB$4=0,\"\",+VLOOKUP(\"x\",Eingabe!AB$4:$BM$23,38,FALSE))","v":""},{"$f":"IF(HLOOKUP(A33,Berechnung!$C$2:$BJ$6,3,FALSE)=0,\"\",HLOOKUP(A33,Berechnung!$C$2:$BJ$6,3,FALSE))","v":"-"},{"$f":"IF(HLOOKUP(A33,Berechnung!$C$2:$BJ$6,4,FALSE)=0,\"\",HLOOKUP(A33,Berechnung!$C$2:$BJ$6,4,FALSE))","v":"-"},{"$f":"IF(HLOOKUP(A33,Berechnung!$C$2:$BJ$6,5,FALSE)=0,\"\",HLOOKUP(A33,Berechnung!$C$2:$BJ$6,5,FALSE))","v":""},0]
[25,{"$f":"IF(Eingabe!AC$4=0,\"\",+VLOOKUP(\"x\",Eingabe!AC$4:$BM$23,37,FALSE))","v":""},{"$f":"IF(HLOOKUP(A34,Berechnung!$C$2:$BJ$6,3,FALSE)=0,\"\",HLOOKUP(A34,Berechnung!$C$2:$BJ$6,3,FALSE))","v":"-"},{"$f":"IF(HLOOKUP(A34,Berechnung!$C$2:$BJ$6,4,FALSE)=0,\"\",HLOOKUP(A34,Berechnung!$C$2:$BJ$6,4,FALSE))","v":"-"},{"$f":"IF(HLOOKUP(A34,Berechnung!$C$2:$BJ$6,5,FALSE)=0,\"\",HLOOKUP(A34,Berechnung!$C$2:$BJ$6,5,FALSE))","v":""},0,null,{"$f":"IF(J34=0,\"\",IF(J34=J32,H32,5))","v":5},{"$f":"IF(Eingabe!B8=0,\"\",WW!$B$7)","v":"Gottfried Weinhäupl"},{"$f":"IF(Eingabe!B8=0,0,WW!$A$7)","v":20},{"$f":"IF(J34=0,\"\",+VLOOKUP(I34,PV!$5:$40,2,FALSE))","v":6},{"$f":"IF(J34=0,\"\",+VLOOKUP(I34,PV!$5:$40,3,FALSE))","v":6.5},{"$f":"IF(J34=0,\"\",+VLOOKUP(I34,PV!$5:$40,4,FALSE))","v":7.5}]
[26,{"$f":"IF(Eingabe!AD$4=0,\"\",+VLOOKUP(\"x\",Eingabe!AD$4:$BM$23,36,FALSE))","v":""},{"$f":"IF(HLOOKUP(A35,Berechnung!$C$2:$BJ$6,3,FALSE)=0,\"\",HLOOKUP(A35,Berechnung!$C$2:$BJ$6,3,FALSE))","v":"-"},{"$f":"IF(HLOOKUP(A35,Berechnung!$C$2:$BJ$6,4,FALSE)=0,\"\",HLOOKUP(A35,Berechnung!$C$2:$BJ$6,4,FALSE))","v":"-"},{"$f":"IF(HLOOKUP(A35,Berechnung!$C$2:$BJ$6,5,FALSE)=0,\"\",HLOOKUP(A35,Berechnung!$C$2:$BJ$6,5,FALSE))","v":""},0]
[27,{"$f":"IF(Eingabe!AE$4=0,\"\",+VLOOKUP(\"x\",Eingabe!AE$4:$BM$23,35,FALSE))","v":""},{"$f":"IF(HLOOKUP(A36,Berechnung!$C$2:$BJ$6,3,FALSE)=0,\"\",HLOOKUP(A36,Berechnung!$C$2:$BJ$6,3,FALSE))","v":"-"},{"$f":"IF(HLOOKUP(A36,Berechnung!$C$2:$BJ$6,4,FALSE)=0,\"\",HLOOKUP(A36,Berechnung!$C$2:$BJ$6,4,FALSE))","v":"-"},{"$f":"IF(HLOOKUP(A36,Berechnung!$C$2:$BJ$6,5,FALSE)=0,\"\",HLOOKUP(A36,Berechnung!$C$2:$BJ$6,5,FALSE))","v":""},0,null,{"$f":"IF(J36=0,\"\",IF(J36=J34,H34,6))","v":""},{"$f":"IF(Eingabe!B9=0,\"\",WW!$B$8)","v":""},{"$f":"IF(Eingabe!B9=0,0,WW!$A$8)","v":0},{"$f":"IF(J36=0,\"\",+VLOOKUP(I36,PV!$5:$40,2,FALSE))","v":""},{"$f":"IF(J36=0,\"\",+VLOOKUP(I36,PV!$5:$40,3,FALSE))","v":""},{"$f":"IF(J36=0,\"\",+VLOOKUP(I36,PV!$5:$40,4,FALSE))","v":""}]
[28,{"$f":"IF(Eingabe!AF$4=0,\"\",+VLOOKUP(\"x\",Eingabe!AF$4:$BM$23,34,FALSE))","v":""},{"$f":"IF(HLOOKUP(A37,Berechnung!$C$2:$BJ$6,3,FALSE)=0,\"\",HLOOKUP(A37,Berechnung!$C$2:$BJ$6,3,FALSE))","v":"-"},{"$f":"IF(HLOOKUP(A37,Berechnung!$C$2:$BJ$6,4,FALSE)=0,\"\",HLOOKUP(A37,Berechnung!$C$2:$BJ$6,4,FALSE))","v":"-"},{"$f":"IF(HLOOKUP(A37,Berechnung!$C$2:$BJ$6,5,FALSE)=0,\"\",HLOOKUP(A37,Berechnung!$C$2:$BJ$6,5,FALSE))","v":""},0]
[29,{"$f":"IF(Eingabe!AG$4=0,\"\",+VLOOKUP(\"x\",Eingabe!AG$4:$BM$23,33,FALSE))","v":""},{"$f":"IF(HLOOKUP(A38,Berechnung!$C$2:$BJ$6,3,FALSE)=0,\"\",HLOOKUP(A38,Berechnung!$C$2:$BJ$6,3,FALSE))","v":"-"},{"$f":"IF(HLOOKUP(A38,Berechnung!$C$2:$BJ$6,4,FALSE)=0,\"\",HLOOKUP(A38,Berechnung!$C$2:$BJ$6,4,FALSE))","v":"-"},{"$f":"IF(HLOOKUP(A38,Berechnung!$C$2:$BJ$6,5,FALSE)=0,\"\",HLOOKUP(A38,Berechnung!$C$2:$BJ$6,5,FALSE))","v":""},0,null,{"$f":"IF(J38=0,\"\",IF(J38=J36,H36,7))","v":""},{"$f":"IF(Eingabe!B10=0,\"\",WW!$B$9)","v":""},{"$f":"IF(Eingabe!B10=0,0,WW!$A$9)","v":0},{"$f":"IF(J38=0,\"\",+VLOOKUP(I38,PV!$5:$40,2,FALSE))","v":""},{"$f":"IF(J38=0,\"\",+VLOOKUP(I38,PV!$5:$40,3,FALSE))","v":""},{"$f":"IF(J38=0,\"\",+VLOOKUP(I38,PV!$5:$40,4,FALSE))","v":""}]
[30,{"$f":"IF(Eingabe!AH$4=0,\"\",+VLOOKUP(\"x\",Eingabe!AH$4:$BM$23,32,FALSE))","v":""},{"$f":"IF(HLOOKUP(A39,Berechnung!$C$2:$BJ$6,3,FALSE)=0,\"\",HLOOKUP(A39,Berechnung!$C$2:$BJ$6,3,FALSE))","v":"-"},{"$f":"IF(HLOOKUP(A39,Berechnung!$C$2:$BJ$6,4,FALSE)=0,\"\",HLOOKUP(A39,Berechnung!$C$2:$BJ$6,4,FALSE))","v":"-"},{"$f":"IF(HLOOKUP(A39,Berechnung!$C$2:$BJ$6,5,FALSE)=0,\"\",HLOOKUP(A39,Berechnung!$C$2:$BJ$6,5,FALSE))","v":""},0]
[31,{"$f":"IF(Eingabe!AI$4=0,\"\",+VLOOKUP(\"x\",Eingabe!AI$4:$BM$23,31,FALSE))","v":""},{"$f":"IF(HLOOKUP(A40,Berechnung!$C$2:$BJ$6,3,FALSE)=0,\"\",HLOOKUP(A40,Berechnung!$C$2:$BJ$6,3,FALSE))","v":"-"},{"$f":"IF(HLOOKUP(A40,Berechnung!$C$2:$BJ$6,4,FALSE)=0,\"\",HLOOKUP(A40,Berechnung!$C$2:$BJ$6,4,FALSE))","v":"-"},{"$f":"IF(HLOOKUP(A40,Berechnung!$C$2:$BJ$6,5,FALSE)=0,\"\",HLOOKUP(A40,Berechnung!$C$2:$BJ$6,5,FALSE))","v":""},0,null,{"$f":"IF(J40=0,\"\",IF(J40=J38,H38,8))","v":""},{"$f":"IF(Eingabe!B11=0,\"\",WW!$B$10)","v":""},{"$f":"IF(Eingabe!B11=0,0,WW!$A$10)","v":0},{"$f":"IF(J40=0,\"\",+VLOOKUP(I40,PV!$5:$40,2,FALSE))","v":""},{"$f":"IF(J40=0,\"\",+VLOOKUP(I40,PV!$5:$40,3,FALSE))","v":""},{"$f":"IF(J40=0,\"\",+VLOOKUP(I40,PV!$5:$40,4,FALSE))","v":""}]
[32,{"$f":"IF(Eingabe!AJ$4=0,\"\",+VLOOKUP(\"x\",Eingabe!AJ$4:$BM$23,30,FALSE))","v":""},{"$f":"IF(HLOOKUP(A41,Berechnung!$C$2:$BJ$6,3,FALSE)=0,\"\",HLOOKUP(A41,Berechnung!$C$2:$BJ$6,3,FALSE))","v":"-"},{"$f":"IF(HLOOKUP(A41,Berechnung!$C$2:$BJ$6,4,FALSE)=0,\"\",HLOOKUP(A41,Berechnung!$C$2:$BJ$6,4,FALSE))","v":"-"},{"$f":"IF(HLOOKUP(A41,Berechnung!$C$2:$BJ$6,5,FALSE)=0,\"\",HLOOKUP(A41,Berechnung!$C$2:$BJ$6,5,FALSE))","v":""},0]
[33,{"$f":"IF(Eingabe!AK$4=0,\"\",+VLOOKUP(\"x\",Eingabe!AK$4:$BM$23,29,FALSE))","v":""},{"$f":"IF(HLOOKUP(A42,Berechnung!$C$2:$BJ$6,3,FALSE)=0,\"\",HLOOKUP(A42,Berechnung!$C$2:$BJ$6,3,FALSE))","v":"-"},{"$f":"IF(HLOOKUP(A42,Berechnung!$C$2:$BJ$6,4,FALSE)=0,\"\",HLOOKUP(A42,Berechnung!$C$2:$BJ$6,4,FALSE))","v":"-"},{"$f":"IF(HLOOKUP(A42,Berechnung!$C$2:$BJ$6,5,FALSE)=0,\"\",HLOOKUP(A42,Berechnung!$C$2:$BJ$6,5,FALSE))","v":""},0,null,{"$f":"IF(J42=0,\"\",IF(J42=J40,H40,9))","v":""},{"$f":"IF(Eingabe!B12=0,\"\",WW!$B$11)","v":""},{"$f":"IF(Eingabe!B12=0,0,WW!$A$11)","v":0},{"$f":"IF(J42=0,\"\",+VLOOKUP(I42,PV!$5:$40,2,FALSE))","v":""},{"$f":"IF(J42=0,\"\",+VLOOKUP(I42,PV!$5:$40,3,FALSE))","v":""},{"$f":"IF(J42=0,\"\",+VLOOKUP(I42,PV!$5:$40,4,FALSE))","v":""}]
[34,{"$f":"IF(Eingabe!AL$4=0,\"\",+VLOOKUP(\"x\",Eingabe!AL$4:$BM$23,28,FALSE))","v":""},{"$f":"IF(HLOOKUP(A43,Berechnung!$C$2:$BJ$6,3,FALSE)=0,\"\",HLOOKUP(A43,Berechnung!$C$2:$BJ$6,3,FALSE))","v":"-"},{"$f":"IF(HLOOKUP(A43,Berechnung!$C$2:$BJ$6,4,FALSE)=0,\"\",HLOOKUP(A43,Berechnung!$C$2:$BJ$6,4,FALSE))","v":"-"},{"$f":"IF(HLOOKUP(A43,Berechnung!$C$2:$BJ$6,5,FALSE)=0,\"\",HLOOKUP(A43,Berechnung!$C$2:$BJ$6,5,FALSE))","v":""},0]
[35,{"$f":"IF(Eingabe!AM$4=0,\"\",+VLOOKUP(\"x\",Eingabe!AM$4:$BM$23,27,FALSE))","v":""},{"$f":"IF(HLOOKUP(A44,Berechnung!$C$2:$BJ$6,3,FALSE)=0,\"\",HLOOKUP(A44,Berechnung!$C$2:$BJ$6,3,FALSE))","v":"-"},{"$f":"IF(HLOOKUP(A44,Berechnung!$C$2:$BJ$6,4,FALSE)=0,\"\",HLOOKUP(A44,Berechnung!$C$2:$BJ$6,4,FALSE))","v":"-"},{"$f":"IF(HLOOKUP(A44,Berechnung!$C$2:$BJ$6,5,FALSE)=0,\"\",HLOOKUP(A44,Berechnung!$C$2:$BJ$6,5,FALSE))","v":""},0,null,{"$f":"IF(J44=0,\"\",IF(J44=J42,H42,10))","v":""},{"$f":"IF(Eingabe!B13=0,\"\",WW!$B$12)","v":""},{"$f":"IF(Eingabe!B13=0,0,WW!$A$12)","v":0},{"$f":"IF(J44=0,\"\",+VLOOKUP(I44,PV!$5:$40,2,FALSE))","v":""},{"$f":"IF(J44=0,\"\",+VLOOKUP(I44,PV!$5:$40,3,FALSE))","v":""},{"$f":"IF(J44=0,\"\",+VLOOKUP(I44,PV!$5:$40,4,FALSE))","v":""}]
[36,{"$f":"IF(Eingabe!AN$4=0,\"\",+VLOOKUP(\"x\",Eingabe!AN$4:$BM$23,26,FALSE))","v":""},{"$f":"IF(HLOOKUP(A45,Berechnung!$C$2:$BJ$6,3,FALSE)=0,\"\",HLOOKUP(A45,Berechnung!$C$2:$BJ$6,3,FALSE))","v":"-"},{"$f":"IF(HLOOKUP(A45,Berechnung!$C$2:$BJ$6,4,FALSE)=0,\"\",HLOOKUP(A45,Berechnung!$C$2:$BJ$6,4,FALSE))","v":"-"},{"$f":"IF(HLOOKUP(A45,Berechnung!$C$2:$BJ$6,5,FALSE)=0,\"\",HLOOKUP(A45,Berechnung!$C$2:$BJ$6,5,FALSE))","v":""},0]
[37,{"$f":"IF(Eingabe!AO$4=0,\"\",+VLOOKUP(\"x\",Eingabe!AO$4:$BM$23,25,FALSE))","v":""},{"$f":"IF(HLOOKUP(A46,Berechnung!$C$2:$BJ$6,3,FALSE)=0,\"\",HLOOKUP(A46,Berechnung!$C$2:$BJ$6,3,FALSE))","v":"-"},{"$f":"IF(HLOOKUP(A46,Berechnung!$C$2:$BJ$6,4,FALSE)=0,\"\",HLOOKUP(A46,Berechnung!$C$2:$BJ$6,4,FALSE))","v":"-"},{"$f":"IF(HLOOKUP(A46,Berechnung!$C$2:$BJ$6,5,FALSE)=0,\"\",HLOOKUP(A46,Berechnung!$C$2:$BJ$6,5,FALSE))","v":""},0,null,{"$f":"IF(J46=0,\"\",IF(J46=J44,H44,11))","v":""},{"$f":"IF(Eingabe!B14=0,\"\",WW!$B$13)","v":""},{"$f":"IF(Eingabe!B14=0,0,WW!$A$13)","v":0},{"$f":"IF(J46=0,\"\",+VLOOKUP(I46,PV!$5:$40,2,FALSE))","v":""},{"$f":"IF(J46=0,\"\",+VLOOKUP(I46,PV!$5:$40,3,FALSE))","v":""},{"$f":"IF(J46=0,\"\",+VLOOKUP(I46,PV!$5:$40,4,FALSE))","v":""}]
[38,{"$f":"IF(Eingabe!AP$4=0,\"\",+VLOOKUP(\"x\",Eingabe!AP$4:$BM$23,24,FALSE))","v":""},{"$f":"IF(HLOOKUP(A47,Berechnung!$C$2:$BJ$6,3,FALSE)=0,\"\",HLOOKUP(A47,Berechnung!$C$2:$BJ$6,3,FALSE))","v":"-"},{"$f":"IF(HLOOKUP(A47,Berechnung!$C$2:$BJ$6,4,FALSE)=0,\"\",HLOOKUP(A47,Berechnung!$C$2:$BJ$6,4,FALSE))","v":"-"},{"$f":"IF(HLOOKUP(A47,Berechnung!$C$2:$BJ$6,5,FALSE)=0,\"\",HLOOKUP(A47,Berechnung!$C$2:$BJ$6,5,FALSE))","v":""},0]
[39,{"$f":"IF(Eingabe!AQ$4=0,\"\",+VLOOKUP(\"x\",Eingabe!AQ$4:$BM$23,23,FALSE))","v":""},{"$f":"IF(HLOOKUP(A48,Berechnung!$C$2:$BJ$6,3,FALSE)=0,\"\",HLOOKUP(A48,Berechnung!$C$2:$BJ$6,3,FALSE))","v":"-"},{"$f":"IF(HLOOKUP(A48,Berechnung!$C$2:$BJ$6,4,FALSE)=0,\"\",HLOOKUP(A48,Berechnung!$C$2:$BJ$6,4,FALSE))","v":"-"},{"$f":"IF(HLOOKUP(A48,Berechnung!$C$2:$BJ$6,5,FALSE)=0,\"\",HLOOKUP(A48,Berechnung!$C$2:$BJ$6,5,FALSE))","v":""},0,null,{"$f":"IF(J48=0,\"\",IF(J48=J46,H46,12))","v":""},{"$f":"IF(Eingabe!B15=0,\"\",WW!$B$14)","v":""},{"$f":"IF(Eingabe!B15=0,0,WW!$A$14)","v":0},{"$f":"IF(J48=0,\"\",+VLOOKUP(I48,PV!$5:$40,2,FALSE))","v":""},{"$f":"IF(J48=0,\"\",+VLOOKUP(I48,PV!$5:$40,3,FALSE))","v":""},{"$f":"IF(J48=0,\"\",+VLOOKUP(I48,PV!$5:$40,4,FALSE))","v":""}]
[40,{"$f":"IF(Eingabe!AR$4=0,\"\",+VLOOKUP(\"x\",Eingabe!AR$4:$BM$23,22,FALSE))","v":""},{"$f":"IF(HLOOKUP(A49,Berechnung!$C$2:$BJ$6,3,FALSE)=0,\"\",HLOOKUP(A49,Berechnung!$C$2:$BJ$6,3,FALSE))","v":"-"},{"$f":"IF(HLOOKUP(A49,Berechnung!$C$2:$BJ$6,4,FALSE)=0,\"\",HLOOKUP(A49,Berechnung!$C$2:$BJ$6,4,FALSE))","v":"-"},{"$f":"IF(HLOOKUP(A49,Berechnung!$C$2:$BJ$6,5,FALSE)=0,\"\",HLOOKUP(A49,Berechnung!$C$2:$BJ$6,5,FALSE))","v":""},0]
[41,{"$f":"IF(Eingabe!AS$4=0,\"\",+VLOOKUP(\"x\",Eingabe!AS$4:$BM$23,21,FALSE))","v":""},{"$f":"IF(HLOOKUP(A50,Berechnung!$C$2:$BJ$6,3,FALSE)=0,\"\",HLOOKUP(A50,Berechnung!$C$2:$BJ$6,3,FALSE))","v":"-"},{"$f":"IF(HLOOKUP(A50,Berechnung!$C$2:$BJ$6,4,FALSE)=0,\"\",HLOOKUP(A50,Berechnung!$C$2:$BJ$6,4,FALSE))","v":"-"},{"$f":"IF(HLOOKUP(A50,Berechnung!$C$2:$BJ$6,5,FALSE)=0,\"\",HLOOKUP(A50,Berechnung!$C$2:$BJ$6,5,FALSE))","v":""},0,null,{"$f":"IF(J50=0,\"\",IF(J50=J48,H48,13))","v":""},{"$f":"IF(Eingabe!B16=0,\"\",WW!$B$15)","v":""},{"$f":"IF(Eingabe!B16=0,0,WW!$A$15)","v":0},{"$f":"IF(J50=0,\"\",+VLOOKUP(I50,PV!$5:$40,2,FALSE))","v":""},{"$f":"IF(J50=0,\"\",+VLOOKUP(I50,PV!$5:$40,3,FALSE))","v":""},{"$f":"IF(J50=0,\"\",+VLOOKUP(I50,PV!$5:$40,4,FALSE))","v":""}]
[42,{"$f":"IF(Eingabe!AT$4=0,\"\",+VLOOKUP(\"x\",Eingabe!AT$4:$BM$23,20,FALSE))","v":""},{"$f":"IF(HLOOKUP(A51,Berechnung!$C$2:$BJ$6,3,FALSE)=0,\"\",HLOOKUP(A51,Berechnung!$C$2:$BJ$6,3,FALSE))","v":"-"},{"$f":"IF(HLOOKUP(A51,Berechnung!$C$2:$BJ$6,4,FALSE)=0,\"\",HLOOKUP(A51,Berechnung!$C$2:$BJ$6,4,FALSE))","v":"-"},{"$f":"IF(HLOOKUP(A51,Berechnung!$C$2:$BJ$6,5,FALSE)=0,\"\",HLOOKUP(A51,Berechnung!$C$2:$BJ$6,5,FALSE))","v":""},0]
[43,{"$f":"IF(Eingabe!AU$4=0,\"\",+VLOOKUP(\"x\",Eingabe!AU$4:$BM$23,19,FALSE))","v":""},{"$f":"IF(HLOOKUP(A52,Berechnung!$C$2:$BJ$6,3,FALSE)=0,\"\",HLOOKUP(A52,Berechnung!$C$2:$BJ$6,3,FALSE))","v":"-"},{"$f":"IF(HLOOKUP(A52,Berechnung!$C$2:$BJ$6,4,FALSE)=0,\"\",HLOOKUP(A52,Berechnung!$C$2:$BJ$6,4,FALSE))","v":"-"},{"$f":"IF(HLOOKUP(A52,Berechnung!$C$2:$BJ$6,5,FALSE)=0,\"\",HLOOKUP(A52,Berechnung!$C$2:$BJ$6,5,FALSE))","v":""},0,null,{"$f":"IF(J52=0,\"\",IF(J52=J50,H50,14))","v":""},{"$f":"IF(Eingabe!B17=0,\"\",WW!$B$16)","v":""},{"$f":"IF(Eingabe!B17=0,0,WW!$A$16)","v":0},{"$f":"IF(J52=0,\"\",+VLOOKUP(I52,PV!$5:$40,2,FALSE))","v":""},{"$f":"IF(J52=0,\"\",+VLOOKUP(I52,PV!$5:$40,3,FALSE))","v":""},{"$f":"IF(J52=0,\"\",+VLOOKUP(I52,PV!$5:$40,4,FALSE))","v":""}]
[44,{"$f":"IF(Eingabe!AV$4=0,\"\",+VLOOKUP(\"x\",Eingabe!AV$4:$BM$23,18,FALSE))","v":""},{"$f":"IF(HLOOKUP(A53,Berechnung!$C$2:$BJ$6,3,FALSE)=0,\"\",HLOOKUP(A53,Berechnung!$C$2:$BJ$6,3,FALSE))","v":"-"},{"$f":"IF(HLOOKUP(A53,Berechnung!$C$2:$BJ$6,4,FALSE)=0,\"\",HLOOKUP(A53,Berechnung!$C$2:$BJ$6,4,FALSE))","v":"-"},{"$f":"IF(HLOOKUP(A53,Berechnung!$C$2:$BJ$6,5,FALSE)=0,\"\",HLOOKUP(A53,Berechnung!$C$2:$BJ$6,5,FALSE))","v":""},0]
[45,{"$f":"IF(Eingabe!AW$4=0,\"\",+VLOOKUP(\"x\",Eingabe!AW$4:$BM$23,17,FALSE))","v":""},{"$f":"IF(HLOOKUP(A54,Berechnung!$C$2:$BJ$6,3,FALSE)=0,\"\",HLOOKUP(A54,Berechnung!$C$2:$BJ$6,3,FALSE))","v":"-"},{"$f":"IF(HLOOKUP(A54,Berechnung!$C$2:$BJ$6,4,FALSE)=0,\"\",HLOOKUP(A54,Berechnung!$C$2:$BJ$6,4,FALSE))","v":"-"},{"$f":"IF(HLOOKUP(A54,Berechnung!$C$2:$BJ$6,5,FALSE)=0,\"\",HLOOKUP(A54,Berechnung!$C$2:$BJ$6,5,FALSE))","v":""},0,null,{"$f":"IF(J54=0,\"\",IF(J54=J52,H52,15))","v":""},{"$f":"IF(Eingabe!B18=0,\"\",WW!$B$17)","v":""},{"$f":"IF(Eingabe!B18=0,0,WW!$A$17)","v":0},{"$f":"IF(J54=0,\"\",+VLOOKUP(I54,PV!$5:$40,2,FALSE))","v":""},{"$f":"IF(J54=0,\"\",+VLOOKUP(I54,PV!$5:$40,3,FALSE))","v":""},{"$f":"IF(J54=0,\"\",+VLOOKUP(I54,PV!$5:$40,4,FALSE))","v":""}]
[46,{"$f":"IF(Eingabe!AX$4=0,\"\",+VLOOKUP(\"x\",Eingabe!AX$4:$BM$23,16,FALSE))","v":""},{"$f":"IF(HLOOKUP(A55,Berechnung!$C$2:$BJ$6,3,FALSE)=0,\"\",HLOOKUP(A55,Berechnung!$C$2:$BJ$6,3,FALSE))","v":"-"},{"$f":"IF(HLOOKUP(A55,Berechnung!$C$2:$BJ$6,4,FALSE)=0,\"\",HLOOKUP(A55,Berechnung!$C$2:$BJ$6,4,FALSE))","v":"-"},{"$f":"IF(HLOOKUP(A55,Berechnung!$C$2:$BJ$6,5,FALSE)=0,\"\",HLOOKUP(A55,Berechnung!$C$2:$BJ$6,5,FALSE))","v":""},0]
[47,{"$f":"IF(Eingabe!AY$4=0,\"\",+VLOOKUP(\"x\",Eingabe!AY$4:$BM$23,15,FALSE))","v":""},{"$f":"IF(HLOOKUP(A56,Berechnung!$C$2:$BJ$6,3,FALSE)=0,\"\",HLOOKUP(A56,Berechnung!$C$2:$BJ$6,3,FALSE))","v":"-"},{"$f":"IF(HLOOKUP(A56,Berechnung!$C$2:$BJ$6,4,FALSE)=0,\"\",HLOOKUP(A56,Berechnung!$C$2:$BJ$6,4,FALSE))","v":"-"},{"$f":"IF(HLOOKUP(A56,Berechnung!$C$2:$BJ$6,5,FALSE)=0,\"\",HLOOKUP(A56,Berechnung!$C$2:$BJ$6,5,FALSE))","v":""},0,null,{"$f":"IF(J56=0,\"\",IF(J56=J54,H54,16))","v":""},{"$f":"IF(Eingabe!B19=0,\"\",WW!$B$18)","v":""},{"$f":"IF(Eingabe!B19=0,0,WW!$A$18)","v":0},{"$f":"IF(J56=0,\"\",+VLOOKUP(I56,PV!$5:$40,2,FALSE))","v":""},{"$f":"IF(J56=0,\"\",+VLOOKUP(I56,PV!$5:$40,3,FALSE))","v":""},{"$f":"IF(J56=0,\"\",+VLOOKUP(I56,PV!$5:$40,4,FALSE))","v":""}]
[48,{"$f":"IF(Eingabe!AZ$4=0,\"\",+VLOOKUP(\"x\",Eingabe!AZ$4:$BM$23,14,FALSE))","v":""},{"$f":"IF(HLOOKUP(A57,Berechnung!$C$2:$BJ$6,3,FALSE)=0,\"\",HLOOKUP(A57,Berechnung!$C$2:$BJ$6,3,FALSE))","v":"-"},{"$f":"IF(HLOOKUP(A57,Berechnung!$C$2:$BJ$6,4,FALSE)=0,\"\",HLOOKUP(A57,Berechnung!$C$2:$BJ$6,4,FALSE))","v":"-"},{"$f":"IF(HLOOKUP(A57,Berechnung!$C$2:$BJ$6,5,FALSE)=0,\"\",HLOOKUP(A57,Berechnung!$C$2:$BJ$6,5,FALSE))","v":""},0]
[49,{"$f":"IF(Eingabe!BA$4=0,\"\",+VLOOKUP(\"x\",Eingabe!BA$4:$BM$23,13,FALSE))","v":""},{"$f":"IF(HLOOKUP(A58,Berechnung!$C$2:$BJ$6,3,FALSE)=0,\"\",HLOOKUP(A58,Berechnung!$C$2:$BJ$6,3,FALSE))","v":"-"},{"$f":"IF(HLOOKUP(A58,Berechnung!$C$2:$BJ$6,4,FALSE)=0,\"\",HLOOKUP(A58,Berechnung!$C$2:$BJ$6,4,FALSE))","v":"-"},{"$f":"IF(HLOOKUP(A58,Berechnung!$C$2:$BJ$6,5,FALSE)=0,\"\",HLOOKUP(A58,Berechnung!$C$2:$BJ$6,5,FALSE))","v":""},0,null,{"$f":"IF(J58=0,\"\",IF(J58=J56,H56,17))","v":""},{"$f":"IF(Eingabe!B20=0,\"\",WW!$B$19)","v":""},{"$f":"IF(Eingabe!B20=0,0,WW!$A$19)","v":0},{"$f":"IF(J58=0,\"\",+VLOOKUP(I58,PV!$5:$40,2,FALSE))","v":""},{"$f":"IF(J58=0,\"\",+VLOOKUP(I58,PV!$5:$40,3,FALSE))","v":""},{"$f":"IF(J58=0,\"\",+VLOOKUP(I58,PV!$5:$40,4,FALSE))","v":""}]
[50,{"$f":"IF(Eingabe!BB$4=0,\"\",+VLOOKUP(\"x\",Eingabe!BB$4:$BM$23,12,FALSE))","v":""},{"$f":"IF(HLOOKUP(A59,Berechnung!$C$2:$BJ$6,3,FALSE)=0,\"\",HLOOKUP(A59,Berechnung!$C$2:$BJ$6,3,FALSE))","v":"-"},{"$f":"IF(HLOOKUP(A59,Berechnung!$C$2:$BJ$6,4,FALSE)=0,\"\",HLOOKUP(A59,Berechnung!$C$2:$BJ$6,4,FALSE))","v":"-"},{"$f":"IF(HLOOKUP(A59,Berechnung!$C$2:$BJ$6,5,FALSE)=0,\"\",HLOOKUP(A59,Berechnung!$C$2:$BJ$6,5,FALSE))","v":""},0]
[51,{"$f":"IF(Eingabe!BC$4=0,\"\",+VLOOKUP(\"x\",Eingabe!BC$4:$BM$23,11,FALSE))","v":""},{"$f":"IF(HLOOKUP(A60,Berechnung!$C$2:$BJ$6,3,FALSE)=0,\"\",HLOOKUP(A60,Berechnung!$C$2:$BJ$6,3,FALSE))","v":"-"},{"$f":"IF(HLOOKUP(A60,Berechnung!$C$2:$BJ$6,4,FALSE)=0,\"\",HLOOKUP(A60,Berechnung!$C$2:$BJ$6,4,FALSE))","v":"-"},{"$f":"IF(HLOOKUP(A60,Berechnung!$C$2:$BJ$6,5,FALSE)=0,\"\",HLOOKUP(A60,Berechnung!$C$2:$BJ$6,5,FALSE))","v":""},0,null,{"$f":"IF(J60=0,\"\",IF(J60=J58,H58,18))","v":""},{"$f":"IF(Eingabe!B21=0,\"\",WW!$B$20)","v":""},{"$f":"IF(Eingabe!B21=0,0,WW!$A$20)","v":0},{"$f":"IF(J60=0,\"\",+VLOOKUP(I60,PV!$5:$40,2,FALSE))","v":""},{"$f":"IF(J60=0,\"\",+VLOOKUP(I60,PV!$5:$40,3,FALSE))","v":""},{"$f":"IF(J60=0,\"\",+VLOOKUP(I60,PV!$5:$40,4,FALSE))","v":""}]
[52,{"$f":"IF(Eingabe!BD$4=0,\"\",+VLOOKUP(\"x\",Eingabe!BD$4:$BM$23,10,FALSE))","v":""},{"$f":"IF(HLOOKUP(A61,Berechnung!$C$2:$BJ$6,3,FALSE)=0,\"\",HLOOKUP(A61,Berechnung!$C$2:$BJ$6,3,FALSE))","v":"-"},{"$f":"IF(HLOOKUP(A61,Berechnung!$C$2:$BJ$6,4,FALSE)=0,\"\",HLOOKUP(A61,Berechnung!$C$2:$BJ$6,4,FALSE))","v":"-"},{"$f":"IF(HLOOKUP(A61,Berechnung!$C$2:$BJ$6,5,FALSE)=0,\"\",HLOOKUP(A61,Berechnung!$C$2:$BJ$6,5,FALSE))","v":""},0]
[53,{"$f":"IF(Eingabe!BE$4=0,\"\",+VLOOKUP(\"x\",Eingabe!BE$4:$BM$23,9,FALSE))","v":""},{"$f":"IF(HLOOKUP(A62,Berechnung!$C$2:$BJ$6,3,FALSE)=0,\"\",HLOOKUP(A62,Berechnung!$C$2:$BJ$6,3,FALSE))","v":"-"},{"$f":"IF(HLOOKUP(A62,Berechnung!$C$2:$BJ$6,4,FALSE)=0,\"\",HLOOKUP(A62,Berechnung!$C$2:$BJ$6,4,FALSE))","v":"-"},{"$f":"IF(HLOOKUP(A62,Berechnung!$C$2:$BJ$6,5,FALSE)=0,\"\",HLOOKUP(A62,Berechnung!$C$2:$BJ$6,5,FALSE))","v":""},0,null,{"$f":"IF(J62=0,\"\",IF(J62=J60,H60,19))","v":""},{"$f":"IF(Eingabe!B22=0,\"\",WW!$B$21)","v":""},{"$f":"IF(Eingabe!B22=0,0,WW!$A$21)","v":0},{"$f":"IF(J62=0,\"\",+VLOOKUP(I62,PV!$5:$40,2,FALSE))","v":""},{"$f":"IF(J62=0,\"\",+VLOOKUP(I62,PV!$5:$40,3,FALSE))","v":""},{"$f":"IF(J62=0,\"\",+VLOOKUP(I62,PV!$5:$40,4,FALSE))","v":""}]
[54,{"$f":"IF(Eingabe!BF$4=0,\"\",+VLOOKUP(\"x\",Eingabe!BF$4:$BM$23,8,FALSE))","v":""},{"$f":"IF(HLOOKUP(A63,Berechnung!$C$2:$BJ$6,3,FALSE)=0,\"\",HLOOKUP(A63,Berechnung!$C$2:$BJ$6,3,FALSE))","v":"-"},{"$f":"IF(HLOOKUP(A63,Berechnung!$C$2:$BJ$6,4,FALSE)=0,\"\",HLOOKUP(A63,Berechnung!$C$2:$BJ$6,4,FALSE))","v":"-"},{"$f":"IF(HLOOKUP(A63,Berechnung!$C$2:$BJ$6,5,FALSE)=0,\"\",HLOOKUP(A63,Berechnung!$C$2:$BJ$6,5,FALSE))","v":""},0]
[55,{"$f":"IF(Eingabe!BG$4=0,\"\",+VLOOKUP(\"x\",Eingabe!BG$4:$BM$23,7,FALSE))","v":""},{"$f":"IF(HLOOKUP(A64,Berechnung!$C$2:$BJ$6,3,FALSE)=0,\"\",HLOOKUP(A64,Berechnung!$C$2:$BJ$6,3,FALSE))","v":"-"},{"$f":"IF(HLOOKUP(A64,Berechnung!$C$2:$BJ$6,4,FALSE)=0,\"\",HLOOKUP(A64,Berechnung!$C$2:$BJ$6,4,FALSE))","v":"-"},{"$f":"IF(HLOOKUP(A64,Berechnung!$C$2:$BJ$6,5,FALSE)=0,\"\",HLOOKUP(A64,Berechnung!$C$2:$BJ$6,5,FALSE))","v":""},0,null,{"$f":"IF(J64=0,\"\",IF(J64=J62,H62,20))","v":""},{"$f":"IF(Eingabe!B23=0,\"\",WW!$B$22)","v":""},{"$f":"IF(Eingabe!B23=0,0,WW!$A$22)","v":0},{"$f":"IF(J64=0,\"\",+VLOOKUP(I64,PV!$5:$40,2,FALSE))","v":""},{"$f":"IF(J64=0,\"\",+VLOOKUP(I64,PV!$5:$40,3,FALSE))","v":""},{"$f":"IF(J64=0,\"\",+VLOOKUP(I64,PV!$5:$40,4,FALSE))","v":""}]
[56,{"$f":"IF(Eingabe!BH$4=0,\"\",+VLOOKUP(\"x\",Eingabe!BH$4:$BM$23,6,FALSE))","v":""},{"$f":"IF(HLOOKUP(A65,Berechnung!$C$2:$BJ$6,3,FALSE)=0,\"\",HLOOKUP(A65,Berechnung!$C$2:$BJ$6,3,FALSE))","v":"-"},{"$f":"IF(HLOOKUP(A65,Berechnung!$C$2:$BJ$6,4,FALSE)=0,\"\",HLOOKUP(A65,Berechnung!$C$2:$BJ$6,4,FALSE))","v":"-"},{"$f":"IF(HLOOKUP(A65,Berechnung!$C$2:$BJ$6,5,FALSE)=0,\"\",HLOOKUP(A65,Berechnung!$C$2:$BJ$6,5,FALSE))","v":""},0]
[57,{"$f":"IF(Eingabe!BI$4=0,\"\",+VLOOKUP(\"x\",Eingabe!BI$4:$BM$23,5,FALSE))","v":""},{"$f":"IF(HLOOKUP(A66,Berechnung!$C$2:$BJ$6,3,FALSE)=0,\"\",HLOOKUP(A66,Berechnung!$C$2:$BJ$6,3,FALSE))","v":"-"},{"$f":"IF(HLOOKUP(A66,Berechnung!$C$2:$BJ$6,4,FALSE)=0,\"\",HLOOKUP(A66,Berechnung!$C$2:$BJ$6,4,FALSE))","v":"-"},{"$f":"IF(HLOOKUP(A66,Berechnung!$C$2:$BJ$6,5,FALSE)=0,\"\",HLOOKUP(A66,Berechnung!$C$2:$BJ$6,5,FALSE))","v":""},0]
[58,{"$f":"IF(Eingabe!BJ$4=0,\"\",+VLOOKUP(\"x\",Eingabe!BJ$4:$BM$23,4,FALSE))","v":""},{"$f":"IF(HLOOKUP(A67,Berechnung!$C$2:$BJ$6,3,FALSE)=0,\"\",HLOOKUP(A67,Berechnung!$C$2:$BJ$6,3,FALSE))","v":"-"},{"$f":"IF(HLOOKUP(A67,Berechnung!$C$2:$BJ$6,4,FALSE)=0,\"\",HLOOKUP(A67,Berechnung!$C$2:$BJ$6,4,FALSE))","v":"-"},{"$f":"IF(HLOOKUP(A67,Berechnung!$C$2:$BJ$6,5,FALSE)=0,\"\",HLOOKUP(A67,Berechnung!$C$2:$BJ$6,5,FALSE))","v":""},0]
[59,{"$f":"IF(Eingabe!BK$4=0,\"\",+VLOOKUP(\"x\",Eingabe!BK$4:$BM$23,3,FALSE))","v":""},{"$f":"IF(HLOOKUP(A68,Berechnung!$C$2:$BJ$6,3,FALSE)=0,\"\",HLOOKUP(A68,Berechnung!$C$2:$BJ$6,3,FALSE))","v":"-"},{"$f":"IF(HLOOKUP(A68,Berechnung!$C$2:$BJ$6,4,FALSE)=0,\"\",HLOOKUP(A68,Berechnung!$C$2:$BJ$6,4,FALSE))","v":"-"},{"$f":"IF(HLOOKUP(A68,Berechnung!$C$2:$BJ$6,5,FALSE)=0,\"\",HLOOKUP(A68,Berechnung!$C$2:$BJ$6,5,FALSE))","v":""},0]
[60,{"$f":"IF(Eingabe!BL$4=0,\"\",+VLOOKUP(\"x\",Eingabe!BL$4:$BM$23,2,FALSE))","v":""},{"$f":"IF(HLOOKUP(A69,Berechnung!$C$2:$BJ$6,3,FALSE)=0,\"\",HLOOKUP(A69,Berechnung!$C$2:$BJ$6,3,FALSE))","v":"-"},{"$f":"IF(HLOOKUP(A69,Berechnung!$C$2:$BJ$6,4,FALSE)=0,\"\",HLOOKUP(A69,Berechnung!$C$2:$BJ$6,4,FALSE))","v":"-"},{"$f":"IF(HLOOKUP(A69,Berechnung!$C$2:$BJ$6,5,FALSE)=0,\"\",HLOOKUP(A69,Berechnung!$C$2:$BJ$6,5,FALSE))","v":""},0,null,null,null,null,null,null,"© 2007 / Fotoklub Hall in Tirol"]

{"sheet":"WW","index":4,"n_rows":22,"n_cols":2,"rows_kept":22,"cut":false,"hidden":false,"merged":[]}
["GESAMTERGEBNIS"]
[]
[24.5,"Harald Burmann"]
[23.5,"Tobias Ötzbrugger"]
[21.5,"Helga Tötsch"]
[21,"Günther Schatz"]
[20,"Gottfried Weinhäupl"]
[0,""]
[0,""]
[0,""]
[0,""]
[0,""]
[0,""]
[0,""]
[0,""]
[0,""]
[0,""]
[0,""]
[0,""]
[0,""]
[0,""]
[0,""]

{"sheet":"ZW","index":5,"n_rows":62,"n_cols":4,"rows_kept":62,"cut":false,"hidden":false,"merged":[]}
["DIE 6 BESTEN BILDER"]
[]
[8.5,1,1,"Harald Burmann"]
[8.5,1,2,"Tobias Ötzbrugger"]
[8,1,7,"Harald Burmann"]
[8,1,14,"Harald Burmann"]
[7.5,1,3,"Günther Schatz"]
[7.5,1,5,"Helga Tötsch"]
[7.5,1,6,"Tobias Ötzbrugger"]
[7.5,1,11,"Tobias Ötzbrugger"]
[7.5,1,12,"Helga Tötsch"]
[7.5,1,15,"Gottfried Weinhäupl"]
[7,1,13,"Günther Schatz"]
[6.5,1,8,"Gottfried Weinhäupl"]
[6.5,1,9,"Helga Tötsch"]
[6.5,1,10,"Günther Schatz"]
[6,1,4,"Gottfried Weinhäupl"]
[0,1,16,""]
[0,1,17,""]
[0,1,18,""]
[0,1,19,""]
[0,1,20,""]
[0,1,21,""]
[0,1,22,""]
[0,1,23,""]
[0,1,24,""]
[0,1,25,""]
[0,1,26,""]
[0,1,27,""]
[0,1,28,""]
[0,1,29,""]
[0,1,30,""]
[0,1,31,""]
[0,1,32,""]
[0,1,33,""]
[0,1,34,""]
[0,1,35,""]
[0,1,36,""]
[0,1,37,""]
[0,1,38,""]
[0,1,39,""]
[0,1,40,""]
[0,1,41,""]
[0,1,42,""]
[0,1,43,""]
[0,1,44,""]
[0,1,45,""]
[0,1,46,""]
[0,1,47,""]
[0,1,48,""]
[0,1,49,""]
[0,1,50,""]
[0,1,51,""]
[0,1,52,""]
[0,1,53,""]
[0,1,54,""]
[0,1,55,""]
[0,1,56,""]
[0,1,57,""]
[0,1,58,""]
[0,1,59,""]
[0,1,60,""]

{"sheet":"PV","index":6,"n_rows":11,"n_cols":6,"rows_kept":11,"cut":false,"hidden":false,"merged":[]}
[]
[]
["Summe von MW","Zähler"]
["Kanditat",1,2,3,null,"Gesamtergebnis"]
[null,null,null,null,0,0]
["Harald Burmann",8.5,8,8,null,24.5]
["Tobias Ötzbrugger",8.5,7.5,7.5,null,23.5]
["Günther Schatz",7.5,6.5,7,null,21]
["Gottfried Weinhäupl",6,6.5,7.5,null,20]
["Helga Tötsch",7.5,6.5,7.5,null,21.5]
["Gesamtergebnis",38,35,37.5,0,110.5]

{"sheet":"EW","index":7,"n_rows":62,"n_cols":22,"rows_kept":62,"cut":false,"hidden":false,"merged":[]}
[null,"TN: 1","TN: 2","TN: 3","TN: 4","TN: 5","TN: 6","TN: 7","TN: 8","TN: 9","TN: 10","TN: 11","TN: 12","TN: 13","TN: 14","TN: 15","TN: 16","TN: 17","TN: 18","TN: 19","TN: 20","Rest"]
["Bild",{"$f":"IF(Start!$B$5=\"\",\"---\")","v":false},{"$f":"IF(Start!$B$5=\"\",\"---\")","v":false},{"$f":"IF(Start!$B$5=\"\",\"---\")","v":false},{"$f":"IF(Start!$B$5=\"\",\"---\")","v":false},{"$f":"IF(Start!$B$5=\"\",\"---\")","v":false},{"$f":"IF(Start!$B$5=\"\",\"---\")","v":false},{"$f":"IF(Start!$B$5=\"\",\"---\")","v":false},{"$f":"IF(Start!$B$5=\"\",\"---\")","v":false},{"$f":"IF(Start!$B$5=\"\",\"---\")","v":false},{"$f":"IF(Start!$B$5=\"\",\"---\")","v":false},{"$f":"IF(Start!$B$5=\"\",\"---\")","v":false},{"$f":"IF(Start!$B$5=\"\",\"---\")","v":false},{"$f":"IF(Start!$B$5=\"\",\"---\")","v":false},{"$f":"IF(Start!$B$5=\"\",\"---\")","v":false},{"$f":"IF(Start!$B$5=\"\",\"---\")","v":false},{"$f":"IF(Start!$B$5=\"\",\"---\")","v":false},{"$f":"IF(Start!$B$5=\"\",\"---\")","v":false},{"$f":"IF(Start!$B$5=\"\",\"---\")","v":false},{"$f":"IF(Start!$B$5=\"\",\"---\")","v":false},{"$f":"IF(Start!$B$5=\"\",\"---\")","v":false},"xxxxxxx"]
[1,{"$f":"Eingabe!$E4","v":8},{"$f":"Eingabe!$E5","v":"x"},{"$f":"Eingabe!$E6","v":9},{"$f":"Eingabe!$E7","v":7},{"$f":"Eingabe!$E8","v":9},{"$f":"Eingabe!$E9","v":0},{"$f":"Eingabe!$E10","v":0},{"$f":"Eingabe!$E11","v":0},{"$f":"Eingabe!$E12","v":0},{"$f":"Eingabe!$E13","v":0},{"$f":"Eingabe!$E14","v":0},{"$f":"Eingabe!$E15","v":0},{"$f":"Eingabe!$E16","v":0},{"$f":"Eingabe!$E17","v":0},{"$f":"Eingabe!$E18","v":0},{"$f":"Eingabe!$E19","v":0},{"$f":"Eingabe!$E20","v":0},{"$f":"Eingabe!$E21","v":0},{"$f":"Eingabe!$E22","v":0},{"$f":"Eingabe!$E23","v":0}]
[2,{"$f":"Eingabe!$F$4","v":7},{"$f":"Eingabe!$F$5","v":9},{"$f":"Eingabe!$F$6","v":"x"},{"$f":"Eingabe!$F$7","v":8},{"$f":"Eingabe!$F$8","v":10},{"$f":"Eingabe!$F$9","v":0},{"$f":"Eingabe!$F$10","v":0},{"$f":"Eingabe!$F$11","v":0},{"$f":"Eingabe!$F$12","v":0},{"$f":"Eingabe!$F$13","v":0},{"$f":"Eingabe!$F$14","v":0},{"$f":"Eingabe!$F$15","v":0},{"$f":"Eingabe!$F$16","v":0},{"$f":"Eingabe!$F$17","v":0},{"$f":"Eingabe!$F$18","v":0},{"$f":"Eingabe!$F$19","v":0},{"$f":"Eingabe!$F$20","v":0},{"$f":"Eingabe!$F$21","v":0},{"$f":"Eingabe!$F$22","v":0},{"$f":"Eingabe!$F$23","v":0}]
[3,{"$f":"Eingabe!$G$4","v":7},{"$f":"Eingabe!$G$5","v":9},{"$f":"Eingabe!$G$6","v":8},{"$f":"Eingabe!$G$7","v":7},{"$f":"Eingabe!$G$8","v":"x"},{"$f":"Eingabe!$G$9","v":0},{"$f":"Eingabe!$G$10","v":0},{"$f":"Eingabe!$G$11","v":0},{"$f":"Eingabe!$G$12","v":0},{"$f":"Eingabe!$G$13","v":0},{"$f":"Eingabe!$G$14","v":0},{"$f":"Eingabe!$G$15","v":0},{"$f":"Eingabe!$G$16","v":0},{"$f":"Eingabe!$G$17","v":0},{"$f":"Eingabe!$G$18","v":0},{"$f":"Eingabe!$G$19","v":0},{"$f":"Eingabe!$G$20","v":0},{"$f":"Eingabe!$G$21","v":0},{"$f":"Eingabe!$G$22","v":0},{"$f":"Eingabe!$G$23","v":0}]
[4,{"$f":"Eingabe!$H$4","v":"x"},{"$f":"Eingabe!$H$5","v":8},{"$f":"Eingabe!$H$6","v":6},{"$f":"Eingabe!$H$7","v":6},{"$f":"Eingabe!$H$8","v":6},{"$f":"Eingabe!$H$9","v":0},{"$f":"Eingabe!$H$10","v":0},{"$f":"Eingabe!$H$11","v":0},{"$f":"Eingabe!$H$12","v":0},{"$f":"Eingabe!$H$13","v":0},{"$f":"Eingabe!$H$14","v":0},{"$f":"Eingabe!$H$15","v":0},{"$f":"Eingabe!$H$16","v":0},{"$f":"Eingabe!$H$17","v":0},{"$f":"Eingabe!$H$18","v":0},{"$f":"Eingabe!$H$19","v":0},{"$f":"Eingabe!$H$20","v":0},{"$f":"Eingabe!$H$21","v":0},{"$f":"Eingabe!$H$22","v":0},{"$f":"Eingabe!$H$23","v":0}]
[5,{"$f":"Eingabe!$I$4","v":8},{"$f":"Eingabe!$I$5","v":7},{"$f":"Eingabe!$I$6","v":7},{"$f":"Eingabe!$I$7","v":"x"},{"$f":"Eingabe!$I$8","v":10},{"$f":"Eingabe!$I$9","v":0},{"$f":"Eingabe!$I$10","v":0},{"$f":"Eingabe!$I$11","v":0},{"$f":"Eingabe!$I$12","v":0},{"$f":"Eingabe!$I$13","v":0},{"$f":"Eingabe!$I$14","v":0},{"$f":"Eingabe!$I$15","v":0},{"$f":"Eingabe!$I$16","v":0},{"$f":"Eingabe!$I$17","v":0},{"$f":"Eingabe!$I$18","v":0},{"$f":"Eingabe!$I$19","v":0},{"$f":"Eingabe!$I$20","v":0},{"$f":"Eingabe!$I$21","v":0},{"$f":"Eingabe!$I$22","v":0},{"$f":"Eingabe!$I$23","v":0}]
[6,{"$f":"Eingabe!$J$4","v":7},{"$f":"Eingabe!$J$5","v":8},{"$f":"Eingabe!$J$6","v":"x"},{"$f":"Eingabe!$J$7","v":7},{"$f":"Eingabe!$J$8","v":8},{"$f":"Eingabe!$J$9","v":0},{"$f":"Eingabe!$J$10","v":0},{"$f":"Eingabe!$J$11","v":0},{"$f":"Eingabe!$J$12","v":0},{"$f":"Eingabe!$J$13","v":0},{"$f":"Eingabe!$J$14","v":0},{"$f":"Eingabe!$J$15","v":0},{"$f":"Eingabe!$J$16","v":0},{"$f":"Eingabe!$J$17","v":0},{"$f":"Eingabe!$J$18","v":0},{"$f":"Eingabe!$J$19","v":0},{"$f":"Eingabe!$J$20","v":0},{"$f":"Eingabe!$J$21","v":0},{"$f":"Eingabe!$J$22","v":0},{"$f":"Eingabe!$J$23","v":0}]
[7,{"$f":"Eingabe!$K$4","v":8},{"$f":"Eingabe!$K$5","v":"x"},{"$f":"Eingabe!$K$6","v":7},{"$f":"Eingabe!$K$7","v":8},{"$f":"Eingabe!$K$8","v":10},{"$f":"Eingabe!$K$9","v":0},{"$f":"Eingabe!$K$10","v":0},{"$f":"Eingabe!$K$11","v":0},{"$f":"Eingabe!$K$12","v":0},{"$f":"Eingabe!$K$13","v":0},{"$f":"Eingabe!$K$14","v":0},{"$f":"Eingabe!$K$15","v":0},{"$f":"Eingabe!$K$16","v":0},{"$f":"Eingabe!$K$17","v":0},{"$f":"Eingabe!$K$18","v":0},{"$f":"Eingabe!$K$19","v":0},{"$f":"Eingabe!$K$20","v":0},{"$f":"Eingabe!$K$21","v":0},{"$f":"Eingabe!$K$22","v":0},{"$f":"Eingabe!$K$23","v":0}]
[8,{"$f":"Eingabe!$L$4","v":"x"},{"$f":"Eingabe!$L$5","v":7},{"$f":"Eingabe!$L$6","v":6},{"$f":"Eingabe!$L$7","v":7},{"$f":"Eingabe!$L$8","v":6},{"$f":"Eingabe!$L$9","v":0},{"$f":"Eingabe!$L$10","v":0},{"$f":"Eingabe!$L$11","v":0},{"$f":"Eingabe!$L$12","v":0},{"$f":"Eingabe!$L$13","v":0},{"$f":"Eingabe!$L$14","v":0},{"$f":"Eingabe!$L$15","v":0},{"$f":"Eingabe!$L$16","v":0},{"$f":"Eingabe!$L$17","v":0},{"$f":"Eingabe!$L$18","v":0},{"$f":"Eingabe!$L$19","v":0},{"$f":"Eingabe!$L$20","v":0},{"$f":"Eingabe!$L$21","v":0},{"$f":"Eingabe!$L$22","v":0},{"$f":"Eingabe!$L$23","v":0}]
[9,{"$f":"Eingabe!$M$4","v":7},{"$f":"Eingabe!$M$5","v":6},{"$f":"Eingabe!$M$6","v":5},{"$f":"Eingabe!$M$7","v":"x"},{"$f":"Eingabe!$M$8","v":7},{"$f":"Eingabe!$M$9","v":0},{"$f":"Eingabe!$M$10","v":0},{"$f":"Eingabe!$M$11","v":0},{"$f":"Eingabe!$M$12","v":0},{"$f":"Eingabe!$M$13","v":0},{"$f":"Eingabe!$M$14","v":0},{"$f":"Eingabe!$M$15","v":0},{"$f":"Eingabe!$M$16","v":0},{"$f":"Eingabe!$M$17","v":0},{"$f":"Eingabe!$M$18","v":0},{"$f":"Eingabe!$M$19","v":0},{"$f":"Eingabe!$M$20","v":0},{"$f":"Eingabe!$M$21","v":0},{"$f":"Eingabe!$M$22","v":0},{"$f":"Eingabe!$M$23","v":0}]
[10,{"$f":"Eingabe!$N$4","v":8},{"$f":"Eingabe!$N$5","v":6},{"$f":"Eingabe!$N$6","v":6},{"$f":"Eingabe!$N$7","v":7},{"$f":"Eingabe!$N$8","v":"x"},{"$f":"Eingabe!$N$9","v":0},{"$f":"Eingabe!$N$10","v":0},{"$f":"Eingabe!$N$11","v":0},{"$f":"Eingabe!$N$12","v":0},{"$f":"Eingabe!$N$13","v":0},{"$f":"Eingabe!$N$14","v":0},{"$f":"Eingabe!$N$15","v":0},{"$f":"Eingabe!$N$16","v":0},{"$f":"Eingabe!$N$17","v":0},{"$f":"Eingabe!$N$18","v":0},{"$f":"Eingabe!$N$19","v":0},{"$f":"Eingabe!$N$20","v":0},{"$f":"Eingabe!$N$21","v":0},{"$f":"Eingabe!$N$22","v":0},{"$f":"Eingabe!$N$23","v":0}]
[11,{"$f":"Eingabe!$O$4","v":7},{"$f":"Eingabe!$O$5","v":8},{"$f":"Eingabe!$O$6","v":"x"},{"$f":"Eingabe!$O$7","v":7},{"$f":"Eingabe!$O$8","v":8},{"$f":"Eingabe!$O$9","v":0},{"$f":"Eingabe!$O$10","v":0},{"$f":"Eingabe!$O$11","v":0},{"$f":"Eingabe!$O$12","v":0},{"$f":"Eingabe!$O$13","v":0},{"$f":"Eingabe!$O$14","v":0},{"$f":"Eingabe!$O$15","v":0},{"$f":"Eingabe!$O$16","v":0},{"$f":"Eingabe!$O$17","v":0},{"$f":"Eingabe!$O$18","v":0},{"$f":"Eingabe!$O$19","v":0},{"$f":"Eingabe!$O$20","v":0},{"$f":"Eingabe!$O$21","v":0},{"$f":"Eingabe!$O$22","v":0},{"$f":"Eingabe!$O$23","v":0}]
[12,{"$f":"Eingabe!$P$4","v":10},{"$f":"Eingabe!$P$5","v":8},{"$f":"Eingabe!$P$6","v":6},{"$f":"Eingabe!$P$7","v":"x"},{"$f":"Eingabe!$P$8","v":7},{"$f":"Eingabe!$P$9","v":0},{"$f":"Eingabe!$P$10","v":0},{"$f":"Eingabe!$P$11","v":0},{"$f":"Eingabe!$P$12","v":0},{"$f":"Eingabe!$P$13","v":0},{"$f":"Eingabe!$P$14","v":0},{"$f":"Eingabe!$P$15","v":0},{"$f":"Eingabe!$P$16","v":0},{"$f":"Eingabe!$P$17","v":0},{"$f":"Eingabe!$P$18","v":0},{"$f":"Eingabe!$P$19","v":0},{"$f":"Eingabe!$P$20","v":0},{"$f":"Eingabe!$P$21","v":0},{"$f":"Eingabe!$P$22","v":0},{"$f":"Eingabe!$P$23","v":0}]
[13,{"$f":"Eingabe!$Q$4","v":7},{"$f":"Eingabe!$Q$5","v":9},{"$f":"Eingabe!$Q$6","v":7},{"$f":"Eingabe!$Q$7","v":7},{"$f":"Eingabe!$Q$8","v":"x"},{"$f":"Eingabe!$Q$9","v":0},{"$f":"Eingabe!$Q$10","v":0},{"$f":"Eingabe!$Q$11","v":0},{"$f":"Eingabe!$Q$12","v":0},{"$f":"Eingabe!$Q$13","v":0},{"$f":"Eingabe!$Q$14","v":0},{"$f":"Eingabe!$Q$15","v":0},{"$f":"Eingabe!$Q$16","v":0},{"$f":"Eingabe!$Q$17","v":0},{"$f":"Eingabe!$Q$18","v":0},{"$f":"Eingabe!$Q$19","v":0},{"$f":"Eingabe!$Q$20","v":0},{"$f":"Eingabe!$Q$21","v":0},{"$f":"Eingabe!$Q$22","v":0},{"$f":"Eingabe!$Q$23","v":0}]
[14,{"$f":"Eingabe!$R$4","v":8},{"$f":"Eingabe!$R$5","v":"x"},{"$f":"Eingabe!$R$6","v":7},{"$f":"Eingabe!$R$7","v":8},{"$f":"Eingabe!$R$8","v":9},{"$f":"Eingabe!$R$9","v":0},{"$f":"Eingabe!$R$10","v":0},{"$f":"Eingabe!$R$11","v":0},{"$f":"Eingabe!$R$12","v":0},{"$f":"Eingabe!$R$13","v":0},{"$f":"Eingabe!$R$14","v":0},{"$f":"Eingabe!$R$15","v":0},{"$f":"Eingabe!$R$16","v":0},{"$f":"Eingabe!$R$17","v":0},{"$f":"Eingabe!$R$18","v":0},{"$f":"Eingabe!$R$19","v":0},{"$f":"Eingabe!$R$20","v":0},{"$f":"Eingabe!$R$21","v":0},{"$f":"Eingabe!$R$22","v":0},{"$f":"Eingabe!$R$23","v":0}]
[15,{"$f":"Eingabe!$S$4","v":"x"},{"$f":"Eingabe!$S$5","v":8},{"$f":"Eingabe!$S$6","v":8},{"$f":"Eingabe!$S$7","v":7},{"$f":"Eingabe!$S$8","v":7},{"$f":"Eingabe!$S$9","v":0},{"$f":"Eingabe!$S$10","v":0},{"$f":"Eingabe!$S$11","v":0},{"$f":"Eingabe!$S$12","v":0},{"$f":"Eingabe!$S$13","v":0},{"$f":"Eingabe!$S$14","v":0},{"$f":"Eingabe!$S$15","v":0},{"$f":"Eingabe!$S$16","v":0},{"$f":"Eingabe!$S$17","v":0},{"$f":"Eingabe!$S$18","v":0},{"$f":"Eingabe!$S$19","v":0},{"$f":"Eingabe!$S$20","v":0},{"$f":"Eingabe!$S$21","v":0},{"$f":"Eingabe!$S$22","v":0},{"$f":"Eingabe!$S$23","v":0}]
[16,{"$f":"Eingabe!$T$4","v":0},{"$f":"Eingabe!$T$5","v":0},{"$f":"Eingabe!$T$6","v":0},{"$f":"Eingabe!$T$7","v":0},{"$f":"Eingabe!$T$8","v":0},{"$f":"Eingabe!$T$9","v":0},{"$f":"Eingabe!$T$10","v":0},{"$f":"Eingabe!$T$11","v":0},{"$f":"Eingabe!$T$12","v":0},{"$f":"Eingabe!$T$13","v":0},{"$f":"Eingabe!$T$14","v":0},{"$f":"Eingabe!$T$15","v":0},{"$f":"Eingabe!$T$16","v":0},{"$f":"Eingabe!$T$17","v":0},{"$f":"Eingabe!$T$18","v":0},{"$f":"Eingabe!$T$19","v":0},{"$f":"Eingabe!$T$20","v":0},{"$f":"Eingabe!$T$21","v":0},{"$f":"Eingabe!$T$22","v":0},{"$f":"Eingabe!$T$23","v":0}]
[17,{"$f":"Eingabe!$U$4","v":0},{"$f":"Eingabe!$U$5","v":0},{"$f":"Eingabe!$U$6","v":0},{"$f":"Eingabe!$U$7","v":0},{"$f":"Eingabe!$U$8","v":0},{"$f":"Eingabe!$U$9","v":0},{"$f":"Eingabe!$U$10","v":0},{"$f":"Eingabe!$U$11","v":0},{"$f":"Eingabe!$U$12","v":0},{"$f":"Eingabe!$U$13","v":0},{"$f":"Eingabe!$U$14","v":0},{"$f":"Eingabe!$U$15","v":0},{"$f":"Eingabe!$U$16","v":0},{"$f":"Eingabe!$U$17","v":0},{"$f":"Eingabe!$U$18","v":0},{"$f":"Eingabe!$U$19","v":0},{"$f":"Eingabe!$U$20","v":0},{"$f":"Eingabe!$U$21","v":0},{"$f":"Eingabe!$U$22","v":0},{"$f":"Eingabe!$U$23","v":0}]
[18,{"$f":"Eingabe!$V$4","v":0},{"$f":"Eingabe!$V$5","v":0},{"$f":"Eingabe!$V$6","v":0},{"$f":"Eingabe!$V$7","v":0},{"$f":"Eingabe!$V$8","v":0},{"$f":"Eingabe!$V$9","v":0},{"$f":"Eingabe!$V$10","v":0},{"$f":"Eingabe!$V$11","v":0},{"$f":"Eingabe!$V$12","v":0},{"$f":"Eingabe!$V$13","v":0},{"$f":"Eingabe!$V$14","v":0},{"$f":"Eingabe!$V$15","v":0},{"$f":"Eingabe!$V$16","v":0},{"$f":"Eingabe!$V$17","v":0},{"$f":"Eingabe!$V$18","v":0},{"$f":"Eingabe!$V$19","v":0},{"$f":"Eingabe!$V$20","v":0},{"$f":"Eingabe!$V$21","v":0},{"$f":"Eingabe!$V$22","v":0},{"$f":"Eingabe!$V$23","v":0}]
[19,{"$f":"Eingabe!$W$4","v":0},{"$f":"Eingabe!$W$5","v":0},{"$f":"Eingabe!$W$6","v":0},{"$f":"Eingabe!$W$7","v":0},{"$f":"Eingabe!$W$8","v":0},{"$f":"Eingabe!$W$9","v":0},{"$f":"Eingabe!$W$10","v":0},{"$f":"Eingabe!$W$11","v":0},{"$f":"Eingabe!$W$12","v":0},{"$f":"Eingabe!$W$13","v":0},{"$f":"Eingabe!$W$14","v":0},{"$f":"Eingabe!$W$15","v":0},{"$f":"Eingabe!$W$16","v":0},{"$f":"Eingabe!$W$17","v":0},{"$f":"Eingabe!$W$18","v":0},{"$f":"Eingabe!$W$19","v":0},{"$f":"Eingabe!$W$20","v":0},{"$f":"Eingabe!$W$21","v":0},{"$f":"Eingabe!$W$22","v":0},{"$f":"Eingabe!$W$23","v":0}]
[20,{"$f":"Eingabe!$X$4","v":0},{"$f":"Eingabe!$X$5","v":0},{"$f":"Eingabe!$X$6","v":0},{"$f":"Eingabe!$X$7","v":0},{"$f":"Eingabe!$X$8","v":0},{"$f":"Eingabe!$X$9","v":0},{"$f":"Eingabe!$X$10","v":0},{"$f":"Eingabe!$X$11","v":0},{"$f":"Eingabe!$X$12","v":0},{"$f":"Eingabe!$X$13","v":0},{"$f":"Eingabe!$X$14","v":0},{"$f":"Eingabe!$X$15","v":0},{"$f":"Eingabe!$X$16","v":0},{"$f":"Eingabe!$X$17","v":0},{"$f":"Eingabe!$X$18","v":0},{"$f":"Eingabe!$X$19","v":0},{"$f":"Eingabe!$X$20","v":0},{"$f":"Eingabe!$X$21","v":0},{"$f":"Eingabe!$X$22","v":0},{"$f":"Eingabe!$X$23","v":0}]
[21,{"$f":"Eingabe!$Y$4","v":0},{"$f":"Eingabe!$Y$5","v":0},{"$f":"Eingabe!$Y$6","v":0},{"$f":"Eingabe!$Y$7","v":0},{"$f":"Eingabe!$Y$8","v":0},{"$f":"Eingabe!$Y$9","v":0},{"$f":"Eingabe!$Y$10","v":0},{"$f":"Eingabe!$Y$11","v":0},{"$f":"Eingabe!$Y$12","v":0},{"$f":"Eingabe!$Y$13","v":0},{"$f":"Eingabe!$Y$14","v":0},{"$f":"Eingabe!$Y$15","v":0},{"$f":"Eingabe!$Y$16","v":0},{"$f":"Eingabe!$Y$17","v":0},{"$f":"Eingabe!$Y$18","v":0},{"$f":"Eingabe!$Y$19","v":0},{"$f":"Eingabe!$Y$20","v":0},{"$f":"Eingabe!$Y$21","v":0},{"$f":"Eingabe!$Y$22","v":0},{"$f":"Eingabe!$Y$23","v":0}]
[22,{"$f":"Eingabe!$Z$4","v":0},{"$f":"Eingabe!$Z$5","v":0},{"$f":"Eingabe!$Z$6","v":0},{"$f":"Eingabe!$Z$7","v":0},{"$f":"Eingabe!$Z$8","v":0},{"$f":"Eingabe!$Z$9","v":0},{"$f":"Eingabe!$Z$10","v":0},{"$f":"Eingabe!$Z$11","v":0},{"$f":"Eingabe!$Z$12","v":0},{"$f":"Eingabe!$Z$13","v":0},{"$f":"Eingabe!$Z$14","v":0},{"$f":"Eingabe!$Z$15","v":0},{"$f":"Eingabe!$Z$16","v":0},{"$f":"Eingabe!$Z$17","v":0},{"$f":"Eingabe!$Z$18","v":0},{"$f":"Eingabe!$Z$19","v":0},{"$f":"Eingabe!$Z$20","v":0},{"$f":"Eingabe!$Z$21","v":0},{"$f":"Eingabe!$Z$22","v":0},{"$f":"Eingabe!$Z$23","v":0}]
[23,{"$f":"Eingabe!$AA$4","v":0},{"$f":"Eingabe!$AA$5","v":0},{"$f":"Eingabe!$AA$6","v":0},{"$f":"Eingabe!$AA$7","v":0},{"$f":"Eingabe!$AA$8","v":0},{"$f":"Eingabe!$AA$9","v":0},{"$f":"Eingabe!$AA$10","v":0},{"$f":"Eingabe!$AA$11","v":0},{"$f":"Eingabe!$AA$12","v":0},{"$f":"Eingabe!$AA$13","v":0},{"$f":"Eingabe!$AA$14","v":0},{"$f":"Eingabe!$AA$15","v":0},{"$f":"Eingabe!$AA$16","v":0},{"$f":"Eingabe!$AA$17","v":0},{"$f":"Eingabe!$AA$18","v":0},{"$f":"Eingabe!$AA$19","v":0},{"$f":"Eingabe!$AA$20","v":0},{"$f":"Eingabe!$AA$21","v":0},{"$f":"Eingabe!$AA$22","v":0},{"$f":"Eingabe!$AA$23","v":0}]
[24,{"$f":"Eingabe!$AB$4","v":0},{"$f":"Eingabe!$AB$5","v":0},{"$f":"Eingabe!$AB$6","v":0},{"$f":"Eingabe!$AB$7","v":0},{"$f":"Eingabe!$AB$8","v":0},{"$f":"Eingabe!$AB$9","v":0},{"$f":"Eingabe!$AB$10","v":0},{"$f":"Eingabe!$AB$11","v":0},{"$f":"Eingabe!$AB$12","v":0},{"$f":"Eingabe!$AB$13","v":0},{"$f":"Eingabe!$AB$14","v":0},{"$f":"Eingabe!$AB$15","v":0},{"$f":"Eingabe!$AB$16","v":0},{"$f":"Eingabe!$AB$17","v":0},{"$f":"Eingabe!$AB$18","v":0},{"$f":"Eingabe!$AB$19","v":0},{"$f":"Eingabe!$AB$20","v":0},{"$f":"Eingabe!$AB$21","v":0},{"$f":"Eingabe!$AB$22","v":0},{"$f":"Eingabe!$AB$23","v":0}]
[25,{"$f":"Eingabe!$AC$4","v":0},{"$f":"Eingabe!$AC$5","v":0},{"$f":"Eingabe!$AC$6","v":0},{"$f":"Eingabe!$AC$7","v":0},{"$f":"Eingabe!$AC$8","v":0},{"$f":"Eingabe!$AC$9","v":0},{"$f":"Eingabe!$AC$10","v":0},{"$f":"Eingabe!$AC$11","v":0},{"$f":"Eingabe!$AC$12","v":0},{"$f":"Eingabe!$AC$13","v":0},{"$f":"Eingabe!$AC$14","v":0},{"$f":"Eingabe!$AC$15","v":0},{"$f":"Eingabe!$AC$16","v":0},{"$f":"Eingabe!$AC$17","v":0},{"$f":"Eingabe!$AC$18","v":0},{"$f":"Eingabe!$AC$19","v":0},{"$f":"Eingabe!$AC$20","v":0},{"$f":"Eingabe!$AC$21","v":0},{"$f":"Eingabe!$AC$22","v":0},{"$f":"Eingabe!$AC$23","v":0}]
[26,{"$f":"Eingabe!$AD$4","v":0},{"$f":"Eingabe!$AD$5","v":0},{"$f":"Eingabe!$AD$6","v":0},{"$f":"Eingabe!$AD$7","v":0},{"$f":"Eingabe!$AD$8","v":0},{"$f":"Eingabe!$AD$9","v":0},{"$f":"Eingabe!$AD$10","v":0},{"$f":"Eingabe!$AD$11","v":0},{"$f":"Eingabe!$AD$12","v":0},{"$f":"Eingabe!$AD$13","v":0},{"$f":"Eingabe!$AD$14","v":0},{"$f":"Eingabe!$AD$15","v":0},{"$f":"Eingabe!$AD$16","v":0},{"$f":"Eingabe!$AD$17","v":0},{"$f":"Eingabe!$AD$18","v":0},{"$f":"Eingabe!$AD$19","v":0},{"$f":"Eingabe!$AD$20","v":0},{"$f":"Eingabe!$AD$21","v":0},{"$f":"Eingabe!$AD$22","v":0},{"$f":"Eingabe!$AD$23","v":0}]
[27,{"$f":"Eingabe!$AE$4","v":0},{"$f":"Eingabe!$AE$5","v":0},{"$f":"Eingabe!$AE$6","v":0},{"$f":"Eingabe!$AE$7","v":0},{"$f":"Eingabe!$AE$8","v":0},{"$f":"Eingabe!$AE$9","v":0},{"$f":"Eingabe!$AE$10","v":0},{"$f":"Eingabe!$AE$11","v":0},{"$f":"Eingabe!$AE$12","v":0},{"$f":"Eingabe!$AE$13","v":0},{"$f":"Eingabe!$AE$14","v":0},{"$f":"Eingabe!$AE$15","v":0},{"$f":"Eingabe!$AE$16","v":0},{"$f":"Eingabe!$AE$17","v":0},{"$f":"Eingabe!$AE$18","v":0},{"$f":"Eingabe!$AE$19","v":0},{"$f":"Eingabe!$AE$20","v":0},{"$f":"Eingabe!$AE$21","v":0},{"$f":"Eingabe!$AE$22","v":0},{"$f":"Eingabe!$AE$23","v":0}]
[28,{"$f":"Eingabe!$AF$4","v":0},{"$f":"Eingabe!$AF$5","v":0},{"$f":"Eingabe!$AF$6","v":0},{"$f":"Eingabe!$AF$7","v":0},{"$f":"Eingabe!$AF$8","v":0},{"$f":"Eingabe!$AF$9","v":0},{"$f":"Eingabe!$AF$10","v":0},{"$f":"Eingabe!$AF$11","v":0},{"$f":"Eingabe!$AF$12","v":0},{"$f":"Eingabe!$AF$13","v":0},{"$f":"Eingabe!$AF$14","v":0},{"$f":"Eingabe!$AF$15","v":0},{"$f":"Eingabe!$AF$16","v":0},{"$f":"Eingabe!$AF$17","v":0},{"$f":"Eingabe!$AF$18","v":0},{"$f":"Eingabe!$AF$19","v":0},{"$f":"Eingabe!$AF$20","v":0},{"$f":"Eingabe!$AF$21","v":0},{"$f":"Eingabe!$AF$22","v":0},{"$f":"Eingabe!$AF$23","v":0}]
[29,{"$f":"Eingabe!$AG$4","v":0},{"$f":"Eingabe!$AG$5","v":0},{"$f":"Eingabe!$AG$6","v":0},{"$f":"Eingabe!$AG$7","v":0},{"$f":"Eingabe!$AG$8","v":0},{"$f":"Eingabe!$AG$9","v":0},{"$f":"Eingabe!$AG$10","v":0},{"$f":"Eingabe!$AG$11","v":0},{"$f":"Eingabe!$AG$12","v":0},{"$f":"Eingabe!$AG$13","v":0},{"$f":"Eingabe!$AG$14","v":0},{"$f":"Eingabe!$AG$15","v":0},{"$f":"Eingabe!$AG$16","v":0},{"$f":"Eingabe!$AG$17","v":0},{"$f":"Eingabe!$AG$18","v":0},{"$f":"Eingabe!$AG$19","v":0},{"$f":"Eingabe!$AG$20","v":0},{"$f":"Eingabe!$AG$21","v":0},{"$f":"Eingabe!$AG$22","v":0},{"$f":"Eingabe!$AG$23","v":0}]
[30,{"$f":"Eingabe!$AH$4","v":0},{"$f":"Eingabe!$AH$5","v":0},{"$f":"Eingabe!$AH$6","v":0},{"$f":"Eingabe!$AH$7","v":0},{"$f":"Eingabe!$AH$8","v":0},{"$f":"Eingabe!$AH$9","v":0},{"$f":"Eingabe!$AH$10","v":0},{"$f":"Eingabe!$AH$11","v":0},{"$f":"Eingabe!$AH$12","v":0},{"$f":"Eingabe!$AH$13","v":0},{"$f":"Eingabe!$AH$14","v":0},{"$f":"Eingabe!$AH$15","v":0},{"$f":"Eingabe!$AH$16","v":0},{"$f":"Eingabe!$AH$17","v":0},{"$f":"Eingabe!$AH$18","v":0},{"$f":"Eingabe!$AH$19","v":0},{"$f":"Eingabe!$AH$20","v":0},{"$f":"Eingabe!$AH$21","v":0},{"$f":"Eingabe!$AH$22","v":0},{"$f":"Eingabe!$AH$23","v":0}]
[31,{"$f":"Eingabe!$AI$4","v":0},{"$f":"Eingabe!$AI$5","v":0},{"$f":"Eingabe!$AI$6","v":0},{"$f":"Eingabe!$AI$7","v":0},{"$f":"Eingabe!$AI$8","v":0},{"$f":"Eingabe!$AI$9","v":0},{"$f":"Eingabe!$AI$10","v":0},{"$f":"Eingabe!$AI$11","v":0},{"$f":"Eingabe!$AI$12","v":0},{"$f":"Eingabe!$AI$13","v":0},{"$f":"Eingabe!$AI$14","v":0},{"$f":"Eingabe!$AI$15","v":0},{"$f":"Eingabe!$AI$16","v":0},{"$f":"Eingabe!$AI$17","v":0},{"$f":"Eingabe!$AI$18","v":0},{"$f":"Eingabe!$AI$19","v":0},{"$f":"Eingabe!$AI$20","v":0},{"$f":"Eingabe!$AI$21","v":0},{"$f":"Eingabe!$AI$22","v":0},{"$f":"Eingabe!$AI$23","v":0}]
[32,{"$f":"Eingabe!$AJ$4","v":0},{"$f":"Eingabe!$AJ$5","v":0},{"$f":"Eingabe!$AJ$6","v":0},{"$f":"Eingabe!$AJ$7","v":0},{"$f":"Eingabe!$AJ$8","v":0},{"$f":"Eingabe!$AJ$9","v":0},{"$f":"Eingabe!$AJ$10","v":0},{"$f":"Eingabe!$AJ$11","v":0},{"$f":"Eingabe!$AJ$12","v":0},{"$f":"Eingabe!$AJ$13","v":0},{"$f":"Eingabe!$AJ$14","v":0},{"$f":"Eingabe!$AJ$15","v":0},{"$f":"Eingabe!$AJ$16","v":0},{"$f":"Eingabe!$AJ$17","v":0},{"$f":"Eingabe!$AJ$18","v":0},{"$f":"Eingabe!$AJ$19","v":0},{"$f":"Eingabe!$AJ$20","v":0},{"$f":"Eingabe!$AJ$21","v":0},{"$f":"Eingabe!$AJ$22","v":0},{"$f":"Eingabe!$AJ$23","v":0}]
[33,{"$f":"Eingabe!$AK$4","v":0},{"$f":"Eingabe!$AK$5","v":0},{"$f":"Eingabe!$AK$6","v":0},{"$f":"Eingabe!$AK$7","v":0},{"$f":"Eingabe!$AK$8","v":0},{"$f":"Eingabe!$AK$9","v":0},{"$f":"Eingabe!$AK$10","v":0},{"$f":"Eingabe!$AK$11","v":0},{"$f":"Eingabe!$AK$12","v":0},{"$f":"Eingabe!$AK$13","v":0},{"$f":"Eingabe!$AK$14","v":0},{"$f":"Eingabe!$AK$15","v":0},{"$f":"Eingabe!$AK$16","v":0},{"$f":"Eingabe!$AK$17","v":0},{"$f":"Eingabe!$AK$18","v":0},{"$f":"Eingabe!$AK$19","v":0},{"$f":"Eingabe!$AK$20","v":0},{"$f":"Eingabe!$AK$21","v":0},{"$f":"Eingabe!$AK$22","v":0},{"$f":"Eingabe!$AK$23","v":0}]
[34,{"$f":"Eingabe!$AL$4","v":0},{"$f":"Eingabe!$AL$5","v":0},{"$f":"Eingabe!$AL$6","v":0},{"$f":"Eingabe!$AL$7","v":0},{"$f":"Eingabe!$AL$8","v":0},{"$f":"Eingabe!$AL$9","v":0},{"$f":"Eingabe!$AL$10","v":0},{"$f":"Eingabe!$AL$11","v":0},{"$f":"Eingabe!$AL$12","v":0},{"$f":"Eingabe!$AL$13","v":0},{"$f":"Eingabe!$AL$14","v":0},{"$f":"Eingabe!$AL$15","v":0},{"$f":"Eingabe!$AL$16","v":0},{"$f":"Eingabe!$AL$17","v":0},{"$f":"Eingabe!$AL$18","v":0},{"$f":"Eingabe!$AL$19","v":0},{"$f":"Eingabe!$AL$20","v":0},{"$f":"Eingabe!$AL$21","v":0},{"$f":"Eingabe!$AL$22","v":0},{"$f":"Eingabe!$AL$23","v":0}]
[35,{"$f":"Eingabe!$AM$4","v":0},{"$f":"Eingabe!$AM$5","v":0},{"$f":"Eingabe!$AM$6","v":0},{"$f":"Eingabe!$AM$7","v":0},{"$f":"Eingabe!$AM$8","v":0},{"$f":"Eingabe!$AM$9","v":0},{"$f":"Eingabe!$AM$10","v":0},{"$f":"Eingabe!$AM$11","v":0},{"$f":"Eingabe!$AM$12","v":0},{"$f":"Eingabe!$AM$13","v":0},{"$f":"Eingabe!$AM$14","v":0},{"$f":"Eingabe!$AM$15","v":0},{"$f":"Eingabe!$AM$16","v":0},{"$f":"Eingabe!$AM$17","v":0},{"$f":"Eingabe!$AM$18","v":0},{"$f":"Eingabe!$AM$19","v":0},{"$f":"Eingabe!$AM$20","v":0},{"$f":"Eingabe!$AM$21","v":0},{"$f":"Eingabe!$AM$22","v":0},{"$f":"Eingabe!$AM$23","v":0}]
[36,{"$f":"Eingabe!$AN$4","v":0},{"$f":"Eingabe!$AN$5","v":0},{"$f":"Eingabe!$AN$6","v":0},{"$f":"Eingabe!$AN$7","v":0},{"$f":"Eingabe!$AN$8","v":0},{"$f":"Eingabe!$AN$9","v":0},{"$f":"Eingabe!$AN$10","v":0},{"$f":"Eingabe!$AN$11","v":0},{"$f":"Eingabe!$AN$12","v":0},{"$f":"Eingabe!$AN$13","v":0},{"$f":"Eingabe!$AN$14","v":0},{"$f":"Eingabe!$AN$15","v":0},{"$f":"Eingabe!$AN$16","v":0},{"$f":"Eingabe!$AN$17","v":0},{"$f":"Eingabe!$AN$18","v":0},{"$f":"Eingabe!$AN$19","v":0},{"$f":"Eingabe!$AN$20","v":0},{"$f":"Eingabe!$AN$21","v":0},{"$f":"Eingabe!$AN$22","v":0},{"$f":"Eingabe!$AN$23","v":0}]
[37,{"$f":"Eingabe!$AO$4","v":0},{"$f":"Eingabe!$AO$5","v":0},{"$f":"Eingabe!$AO$6","v":0},{"$f":"Eingabe!$AO$7","v":0},{"$f":"Eingabe!$AO$8","v":0},{"$f":"Eingabe!$AO$9","v":0},{"$f":"Eingabe!$AO$10","v":0},{"$f":"Eingabe!$AO$11","v":0},{"$f":"Eingabe!$AO$12","v":0},{"$f":"Eingabe!$AO$13","v":0},{"$f":"Eingabe!$AO$14","v":0},{"$f":"Eingabe!$AO$15","v":0},{"$f":"Eingabe!$AO$16","v":0},{"$f":"Eingabe!$AO$17","v":0},{"$f":"Eingabe!$AO$18","v":0},{"$f":"Eingabe!$AO$19","v":0},{"$f":"Eingabe!$AO$20","v":0},{"$f":"Eingabe!$AO$21","v":0},{"$f":"Eingabe!$AO$22","v":0},{"$f":"Eingabe!$AO$23","v":0}]
[38,{"$f":"Eingabe!$AP$4","v":0},{"$f":"Eingabe!$AP$5","v":0},{"$f":"Eingabe!$AP$6","v":0},{"$f":"Eingabe!$AP$7","v":0},{"$f":"Eingabe!$AP$8","v":0},{"$f":"Eingabe!$AP$9","v":0},{"$f":"Eingabe!$AP$10","v":0},{"$f":"Eingabe!$AP$11","v":0},{"$f":"Eingabe!$AP$12","v":0},{"$f":"Eingabe!$AP$13","v":0},{"$f":"Eingabe!$AP$14","v":0},{"$f":"Eingabe!$AP$15","v":0},{"$f":"Eingabe!$AP$16","v":0},{"$f":"Eingabe!$AP$17","v":0},{"$f":"Eingabe!$AP$18","v":0},{"$f":"Eingabe!$AP$19","v":0},{"$f":"Eingabe!$AP$20","v":0},{"$f":"Eingabe!$AP$21","v":0},{"$f":"Eingabe!$AP$22","v":0},{"$f":"Eingabe!$AP$23","v":0}]
[39,{"$f":"Eingabe!$AQ$4","v":0},{"$f":"Eingabe!$AQ$5","v":0},{"$f":"Eingabe!$AQ$6","v":0},{"$f":"Eingabe!$AQ$7","v":0},{"$f":"Eingabe!$AQ$8","v":0},{"$f":"Eingabe!$AQ$9","v":0},{"$f":"Eingabe!$AQ$10","v":0},{"$f":"Eingabe!$AQ$11","v":0},{"$f":"Eingabe!$AQ$12","v":0},{"$f":"Eingabe!$AQ$13","v":0},{"$f":"Eingabe!$AQ$14","v":0},{"$f":"Eingabe!$AQ$15","v":0},{"$f":"Eingabe!$AQ$16","v":0},{"$f":"Eingabe!$AQ$17","v":0},{"$f":"Eingabe!$AQ$18","v":0},{"$f":"Eingabe!$AQ$19","v":0},{"$f":"Eingabe!$AQ$20","v":0},{"$f":"Eingabe!$AQ$21","v":0},{"$f":"Eingabe!$AQ$22","v":0},{"$f":"Eingabe!$AQ$23","v":0}]
[40,{"$f":"Eingabe!$AR$4","v":0},{"$f":"Eingabe!$AR$5","v":0},{"$f":"Eingabe!$AR$6","v":0},{"$f":"Eingabe!$AR$7","v":0},{"$f":"Eingabe!$AR$8","v":0},{"$f":"Eingabe!$AR$9","v":0},{"$f":"Eingabe!$AR$10","v":0},{"$f":"Eingabe!$AR$11","v":0},{"$f":"Eingabe!$AR$12","v":0},{"$f":"Eingabe!$AR$13","v":0},{"$f":"Eingabe!$AR$14","v":0},{"$f":"Eingabe!$AR$15","v":0},{"$f":"Eingabe!$AR$16","v":0},{"$f":"Eingabe!$AR$17","v":0},{"$f":"Eingabe!$AR$18","v":0},{"$f":"Eingabe!$AR$19","v":0},{"$f":"Eingabe!$AR$20","v":0},{"$f":"Eingabe!$AR$21","v":0},{"$f":"Eingabe!$AR$22","v":0},{"$f":"Eingabe!$AR$23","v":0}]
[41,{"$f":"Eingabe!$AS$4","v":0},{"$f":"Eingabe!$AS$5","v":0},{"$f":"Eingabe!$AS$6","v":0},{"$f":"Eingabe!$AS$7","v":0},{"$f":"Eingabe!$AS$8","v":0},{"$f":"Eingabe!$AS$9","v":0},{"$f":"Eingabe!$AS$10","v":0},{"$f":"Eingabe!$AS$11","v":0},{"$f":"Eingabe!$AS$12","v":0},{"$f":"Eingabe!$AS$13","v":0},{"$f":"Eingabe!$AS$14","v":0},{"$f":"Eingabe!$AS$15","v":0},{"$f":"Eingabe!$AS$16","v":0},{"$f":"Eingabe!$AS$17","v":0},{"$f":"Eingabe!$AS$18","v":0},{"$f":"Eingabe!$AS$19","v":0},{"$f":"Eingabe!$AS$20","v":0},{"$f":"Eingabe!$AS$21","v":0},{"$f":"Eingabe!$AS$22","v":0},{"$f":"Eingabe!$AS$23","v":0}]
[42,{"$f":"Eingabe!$AT$4","v":0},{"$f":"Eingabe!$AT$5","v":0},{"$f":"Eingabe!$AT$6","v":0},{"$f":"Eingabe!$AT$7","v":0},{"$f":"Eingabe!$AT$8","v":0},{"$f":"Eingabe!$AT$9","v":0},{"$f":"Eingabe!$AT$10","v":0},{"$f":"Eingabe!$AT$11","v":0},{"$f":"Eingabe!$AT$12","v":0},{"$f":"Eingabe!$AT$13","v":0},{"$f":"Eingabe!$AT$14","v":0},{"$f":"Eingabe!$AT$15","v":0},{"$f":"Eingabe!$AT$16","v":0},{"$f":"Eingabe!$AT$17","v":0},{"$f":"Eingabe!$AT$18","v":0},{"$f":"Eingabe!$AT$19","v":0},{"$f":"Eingabe!$AT$20","v":0},{"$f":"Eingabe!$AT$21","v":0},{"$f":"Eingabe!$AT$22","v":0},{"$f":"Eingabe!$AT$23","v":0}]
[43,{"$f":"Eingabe!$AU$4","v":0},{"$f":"Eingabe!$AU$5","v":0},{"$f":"Eingabe!$AU$6","v":0},{"$f":"Eingabe!$AU$7","v":0},{"$f":"Eingabe!$AU$8","v":0},{"$f":"Eingabe!$AU$9","v":0},{"$f":"Eingabe!$AU$10","v":0},{"$f":"Eingabe!$AU$11","v":0},{"$f":"Eingabe!$AU$12","v":0},{"$f":"Eingabe!$AU$13","v":0},{"$f":"Eingabe!$AU$14","v":0},{"$f":"Eingabe!$AU$15","v":0},{"$f":"Eingabe!$AU$16","v":0},{"$f":"Eingabe!$AU$17","v":0},{"$f":"Eingabe!$AU$18","v":0},{"$f":"Eingabe!$AU$19","v":0},{"$f":"Eingabe!$AU$20","v":0},{"$f":"Eingabe!$AU$21","v":0},{"$f":"Eingabe!$AU$22","v":0},{"$f":"Eingabe!$AU$23","v":0}]
[44,{"$f":"Eingabe!$AV$4","v":0},{"$f":"Eingabe!$AV$5","v":0},{"$f":"Eingabe!$AV$6","v":0},{"$f":"Eingabe!$AV$7","v":0},{"$f":"Eingabe!$AV$8","v":0},{"$f":"Eingabe!$AV$9","v":0},{"$f":"Eingabe!$AV$10","v":0},{"$f":"Eingabe!$AV$11","v":0},{"$f":"Eingabe!$AV$12","v":0},{"$f":"Eingabe!$AV$13","v":0},{"$f":"Eingabe!$AV$14","v":0},{"$f":"Eingabe!$AV$15","v":0},{"$f":"Eingabe!$AV$16","v":0},{"$f":"Eingabe!$AV$17","v":0},{"$f":"Eingabe!$AV$18","v":0},{"$f":"Eingabe!$AV$19","v":0},{"$f":"Eingabe!$AV$20","v":0},{"$f":"Eingabe!$AV$21","v":0},{"$f":"Eingabe!$AV$22","v":0},{"$f":"Eingabe!$AV$23","v":0}]
[45,{"$f":"Eingabe!$AW$4","v":0},{"$f":"Eingabe!$AW$5","v":0},{"$f":"Eingabe!$AW$6","v":0},{"$f":"Eingabe!$AW$7","v":0},{"$f":"Eingabe!$AW$8","v":0},{"$f":"Eingabe!$AW$9","v":0},{"$f":"Eingabe!$AW$10","v":0},{"$f":"Eingabe!$AW$11","v":0},{"$f":"Eingabe!$AW$12","v":0},{"$f":"Eingabe!$AW$13","v":0},{"$f":"Eingabe!$AW$14","v":0},{"$f":"Eingabe!$AW$15","v":0},{"$f":"Eingabe!$AW$16","v":0},{"$f":"Eingabe!$AW$17","v":0},{"$f":"Eingabe!$AW$18","v":0},{"$f":"Eingabe!$AW$19","v":0},{"$f":"Eingabe!$AW$20","v":0},{"$f":"Eingabe!$AW$21","v":0},{"$f":"Eingabe!$AW$22","v":0},{"$f":"Eingabe!$AW$23","v":0}]
[46,{"$f":"Eingabe!$AX$4","v":0},{"$f":"Eingabe!$AX$5","v":0},{"$f":"Eingabe!$AX$6","v":0},{"$f":"Eingabe!$AX$7","v":0},{"$f":"Eingabe!$AX$8","v":0},{"$f":"Eingabe!$AX$9","v":0},{"$f":"Eingabe!$AX$10","v":0},{"$f":"Eingabe!$AX$11","v":0},{"$f":"Eingabe!$AX$12","v":0},{"$f":"Eingabe!$AX$13","v":0},{"$f":"Eingabe!$AX$14","v":0},{"$f":"Eingabe!$AX$15","v":0},{"$f":"Eingabe!$AX$16","v":0},{"$f":"Eingabe!$AX$17","v":0},{"$f":"Eingabe!$AX$18","v":0},{"$f":"Eingabe!$AX$19","v":0},{"$f":"Eingabe!$AX$20","v":0},{"$f":"Eingabe!$AX$21","v":0},{"$f":"Eingabe!$AX$22","v":0},{"$f":"Eingabe!$AX$23","v":0}]
[47,{"$f":"Eingabe!$AY$4","v":0},{"$f":"Eingabe!$AY$5","v":0},{"$f":"Eingabe!$AY$6","v":0},{"$f":"Eingabe!$AY$7","v":0},{"$f":"Eingabe!$AY$8","v":0},{"$f":"Eingabe!$AY$9","v":0},{"$f":"Eingabe!$AY$10","v":0},{"$f":"Eingabe!$AY$11","v":0},{"$f":"Eingabe!$AY$12","v":0},{"$f":"Eingabe!$AY$13","v":0},{"$f":"Eingabe!$AY$14","v":0},{"$f":"Eingabe!$AY$15","v":0},{"$f":"Eingabe!$AY$16","v":0},{"$f":"Eingabe!$AY$17","v":0},{"$f":"Eingabe!$AY$18","v":0},{"$f":"Eingabe!$AY$19","v":0},{"$f":"Eingabe!$AY$20","v":0},{"$f":"Eingabe!$AY$21","v":0},{"$f":"Eingabe!$AY$22","v":0},{"$f":"Eingabe!$AY$23","v":0}]
[48,{"$f":"Eingabe!$AZ$4","v":0},{"$f":"Eingabe!$AZ$5","v":0},{"$f":"Eingabe!$AZ$6","v":0},{"$f":"Eingabe!$AZ$7","v":0},{"$f":"Eingabe!$AZ$8","v":0},{"$f":"Eingabe!$AZ$9","v":0},{"$f":"Eingabe!$AZ$10","v":0},{"$f":"Eingabe!$AZ$11","v":0},{"$f":"Eingabe!$AZ$12","v":0},{"$f":"Eingabe!$AZ$13","v":0},{"$f":"Eingabe!$AZ$14","v":0},{"$f":"Eingabe!$AZ$15","v":0},{"$f":"Eingabe!$AZ$16","v":0},{"$f":"Eingabe!$AZ$17","v":0},{"$f":"Eingabe!$AZ$18","v":0},{"$f":"Eingabe!$AZ$19","v":0},{"$f":"Eingabe!$AZ$20","v":0},{"$f":"Eingabe!$AZ$21","v":0},{"$f":"Eingabe!$AZ$22","v":0},{"$f":"Eingabe!$AZ$23","v":0}]
[49,{"$f":"Eingabe!$BA$4","v":0},{"$f":"Eingabe!$BA$5","v":0},{"$f":"Eingabe!$BA$6","v":0},{"$f":"Eingabe!$BA$7","v":0},{"$f":"Eingabe!$BA$8","v":0},{"$f":"Eingabe!$BA$9","v":0},{"$f":"Eingabe!$BA$10","v":0},{"$f":"Eingabe!$BA$11","v":0},{"$f":"Eingabe!$BA$12","v":0},{"$f":"Eingabe!$BA$13","v":0},{"$f":"Eingabe!$BA$14","v":0},{"$f":"Eingabe!$BA$15","v":0},{"$f":"Eingabe!$BA$16","v":0},{"$f":"Eingabe!$BA$17","v":0},{"$f":"Eingabe!$BA$18","v":0},{"$f":"Eingabe!$BA$19","v":0},{"$f":"Eingabe!$BA$20","v":0},{"$f":"Eingabe!$BA$21","v":0},{"$f":"Eingabe!$BA$22","v":0},{"$f":"Eingabe!$BA$23","v":0}]
[50,{"$f":"Eingabe!$BB$4","v":0},{"$f":"Eingabe!$BB$5","v":0},{"$f":"Eingabe!$BB$6","v":0},{"$f":"Eingabe!$BB$7","v":0},{"$f":"Eingabe!$BB$8","v":0},{"$f":"Eingabe!$BB$9","v":0},{"$f":"Eingabe!$BB$10","v":0},{"$f":"Eingabe!$BB$11","v":0},{"$f":"Eingabe!$BB$12","v":0},{"$f":"Eingabe!$BB$13","v":0},{"$f":"Eingabe!$BB$14","v":0},{"$f":"Eingabe!$BB$15","v":0},{"$f":"Eingabe!$BB$16","v":0},{"$f":"Eingabe!$BB$17","v":0},{"$f":"Eingabe!$BB$18","v":0},{"$f":"Eingabe!$BB$19","v":0},{"$f":"Eingabe!$BB$20","v":0},{"$f":"Eingabe!$BB$21","v":0},{"$f":"Eingabe!$BB$22","v":0},{"$f":"Eingabe!$BB$23","v":0}]
[51,{"$f":"Eingabe!$BC$4","v":0},{"$f":"Eingabe!$BC$5","v":0},{"$f":"Eingabe!$BC$6","v":0},{"$f":"Eingabe!$BC$7","v":0},{"$f":"Eingabe!$BC$8","v":0},{"$f":"Eingabe!$BC$9","v":0},{"$f":"Eingabe!$BC$10","v":0},{"$f":"Eingabe!$BC$11","v":0},{"$f":"Eingabe!$BC$12","v":0},{"$f":"Eingabe!$BC$13","v":0},{"$f":"Eingabe!$BC$14","v":0},{"$f":"Eingabe!$BC$15","v":0},{"$f":"Eingabe!$BC$16","v":0},{"$f":"Eingabe!$BC$17","v":0},{"$f":"Eingabe!$BC$18","v":0},{"$f":"Eingabe!$BC$19","v":0},{"$f":"Eingabe!$BC$20","v":0},{"$f":"Eingabe!$BC$21","v":0},{"$f":"Eingabe!$BC$22","v":0},{"$f":"Eingabe!$BC$23","v":0}]
[52,{"$f":"Eingabe!$BD$4","v":0},{"$f":"Eingabe!$BD$5","v":0},{"$f":"Eingabe!$BD$6","v":0},{"$f":"Eingabe!$BD$7","v":0},{"$f":"Eingabe!$BD$8","v":0},{"$f":"Eingabe!$BD$9","v":0},{"$f":"Eingabe!$BD$10","v":0},{"$f":"Eingabe!$BD$11","v":0},{"$f":"Eingabe!$BD$12","v":0},{"$f":"Eingabe!$BD$13","v":0},{"$f":"Eingabe!$BD$14","v":0},{"$f":"Eingabe!$BD$15","v":0},{"$f":"Eingabe!$BD$16","v":0},{"$f":"Eingabe!$BD$17","v":0},{"$f":"Eingabe!$BD$18","v":0},{"$f":"Eingabe!$BD$19","v":0},{"$f":"Eingabe!$BD$20","v":0},{"$f":"Eingabe!$BD$21","v":0},{"$f":"Eingabe!$BD$22","v":0},{"$f":"Eingabe!$BD$23","v":0}]
[53,{"$f":"Eingabe!$BE$4","v":0},{"$f":"Eingabe!$BE$5","v":0},{"$f":"Eingabe!$BE$6","v":0},{"$f":"Eingabe!$BE$7","v":0},{"$f":"Eingabe!$BE$8","v":0},{"$f":"Eingabe!$BE$9","v":0},{"$f":"Eingabe!$BE$10","v":0},{"$f":"Eingabe!$BE$11","v":0},{"$f":"Eingabe!$BE$12","v":0},{"$f":"Eingabe!$BE$13","v":0},{"$f":"Eingabe!$BE$14","v":0},{"$f":"Eingabe!$BE$15","v":0},{"$f":"Eingabe!$BE$16","v":0},{"$f":"Eingabe!$BE$17","v":0},{"$f":"Eingabe!$BE$18","v":0},{"$f":"Eingabe!$BE$19","v":0},{"$f":"Eingabe!$BE$20","v":0},{"$f":"Eingabe!$BE$21","v":0},{"$f":"Eingabe!$BE$22","v":0},{"$f":"Eingabe!$BE$23","v":0}]
[54,{"$f":"Eingabe!$BF$4","v":0},{"$f":"Eingabe!$BF$5","v":0},{"$f":"Eingabe!$BF$6","v":0},{"$f":"Eingabe!$BF$7","v":0},{"$f":"Eingabe!$BF$8","v":0},{"$f":"Eingabe!$BF$9","v":0},{"$f":"Eingabe!$BF$10","v":0},{"$f":"Eingabe!$BF$11","v":0},{"$f":"Eingabe!$BF$12","v":0},{"$f":"Eingabe!$BF$13","v":0},{"$f":"Eingabe!$BF$14","v":0},{"$f":"Eingabe!$BF$15","v":0},{"$f":"Eingabe!$BF$16","v":0},{"$f":"Eingabe!$BF$17","v":0},{"$f":"Eingabe!$BF$18","v":0},{"$f":"Eingabe!$BF$19","v":0},{"$f":"Eingabe!$BF$20","v":0},{"$f":"Eingabe!$BF$21","v":0},{"$f":"Eingabe!$BF$22","v":0},{"$f":"Eingabe!$BF$23","v":0}]
[55,{"$f":"Eingabe!$BG$4","v":0},{"$f":"Eingabe!$BG$5","v":0},{"$f":"Eingabe!$BG$6","v":0},{"$f":"Eingabe!$BG$7","v":0},{"$f":"Eingabe!$BG$8","v":0},{"$f":"Eingabe!$BG$9","v":0},{"$f":"Eingabe!$BG$10","v":0},{"$f":"Eingabe!$BG$11","v":0},{"$f":"Eingabe!$BG$12","v":0},{"$f":"Eingabe!$BG$13","v":0},{"$f":"Eingabe!$BG$14","v":0},{"$f":"Eingabe!$BG$15","v":0},{"$f":"Eingabe!$BG$16","v":0},{"$f":"Eingabe!$BG$17","v":0},{"$f":"Eingabe!$BG$18","v":0},{"$f":"Eingabe!$BG$19","v":0},{"$f":"Eingabe!$BG$20","v":0},{"$f":"Eingabe!$BG$21","v":0},{"$f":"Eingabe!$BG$22","v":0},{"$f":"Eingabe!$BG$23","v":0}]
[56,{"$f":"Eingabe!$BH$4","v":0},{"$f":"Eingabe!$BH$5","v":0},{"$f":"Eingabe!$BH$6","v":0},{"$f":"Eingabe!$BH$7","v":0},{"$f":"Eingabe!$BH$8","v":0},{"$f":"Eingabe!$BH$9","v":0},{"$f":"Eingabe!$BH$10","v":0},{"$f":"Eingabe!$BH$11","v":0},{"$f":"Eingabe!$BH$12","v":0},{"$f":"Eingabe!$BH$13","v":0},{"$f":"Eingabe!$BH$14","v":0},{"$f":"Eingabe!$BH$15","v":0},{"$f":"Eingabe!$BH$16","v":0},{"$f":"Eingabe!$BH$17","v":0},{"$f":"Eingabe!$BH$18","v":0},{"$f":"Eingabe!$BH$19","v":0},{"$f":"Eingabe!$BH$20","v":0},{"$f":"Eingabe!$BH$21","v":0},{"$f":"Eingabe!$BH$22","v":0},{"$f":"Eingabe!$BH$23","v":0}]
[57,{"$f":"Eingabe!$BI$4","v":0},{"$f":"Eingabe!$BI$5","v":0},{"$f":"Eingabe!$BI$6","v":0},{"$f":"Eingabe!$BI$7","v":0},{"$f":"Eingabe!$BI$8","v":0},{"$f":"Eingabe!$BI$9","v":0},{"$f":"Eingabe!$BI$10","v":0},{"$f":"Eingabe!$BI$11","v":0},{"$f":"Eingabe!$BI$12","v":0},{"$f":"Eingabe!$BI$13","v":0},{"$f":"Eingabe!$BI$14","v":0},{"$f":"Eingabe!$BI$15","v":0},{"$f":"Eingabe!$BI$16","v":0},{"$f":"Eingabe!$BI$17","v":0},{"$f":"Eingabe!$BI$18","v":0},{"$f":"Eingabe!$BI$19","v":0},{"$f":"Eingabe!$BI$20","v":0},{"$f":"Eingabe!$BI$21","v":0},{"$f":"Eingabe!$BI$22","v":0},{"$f":"Eingabe!$BI$23","v":0}]
[58,{"$f":"Eingabe!$BJ$4","v":0},{"$f":"Eingabe!$BJ$5","v":0},{"$f":"Eingabe!$BJ$6","v":0},{"$f":"Eingabe!$BJ$7","v":0},{"$f":"Eingabe!$BJ$8","v":0},{"$f":"Eingabe!$BJ$9","v":0},{"$f":"Eingabe!$BJ$10","v":0},{"$f":"Eingabe!$BJ$11","v":0},{"$f":"Eingabe!$BJ$12","v":0},{"$f":"Eingabe!$BJ$13","v":0},{"$f":"Eingabe!$BJ$14","v":0},{"$f":"Eingabe!$BJ$15","v":0},{"$f":"Eingabe!$BJ$16","v":0},{"$f":"Eingabe!$BJ$17","v":0},{"$f":"Eingabe!$BJ$18","v":0},{"$f":"Eingabe!$BJ$19","v":0},{"$f":"Eingabe!$BJ$20","v":0},{"$f":"Eingabe!$BJ$21","v":0},{"$f":"Eingabe!$BJ$22","v":0},{"$f":"Eingabe!$BJ$23","v":0}]
[59,{"$f":"Eingabe!$BK$4","v":0},{"$f":"Eingabe!$BK$5","v":0},{"$f":"Eingabe!$BK$6","v":0},{"$f":"Eingabe!$BK$7","v":0},{"$f":"Eingabe!$BK$8","v":0},{"$f":"Eingabe!$BK$9","v":0},{"$f":"Eingabe!$BK$10","v":0},{"$f":"Eingabe!$BK$11","v":0},{"$f":"Eingabe!$BK$12","v":0},{"$f":"Eingabe!$BK$13","v":0},{"$f":"Eingabe!$BK$14","v":0},{"$f":"Eingabe!$BK$15","v":0},{"$f":"Eingabe!$BK$16","v":0},{"$f":"Eingabe!$BK$17","v":0},{"$f":"Eingabe!$BK$18","v":0},{"$f":"Eingabe!$BK$19","v":0},{"$f":"Eingabe!$BK$20","v":0},{"$f":"Eingabe!$BK$21","v":0},{"$f":"Eingabe!$BK$22","v":0},{"$f":"Eingabe!$BK$23","v":0}]
[60,{"$f":"Eingabe!$BL$4","v":0},{"$f":"Eingabe!$BL$5","v":0},{"$f":"Eingabe!$BL$6","v":0},{"$f":"Eingabe!$BL$7","v":0},{"$f":"Eingabe!$BL$8","v":0},{"$f":"Eingabe!$BL$9","v":0},{"$f":"Eingabe!$BL$10","v":0},{"$f":"Eingabe!$BL$11","v":0},{"$f":"Eingabe!$BL$12","v":0},{"$f":"Eingabe!$BL$13","v":0},{"$f":"Eingabe!$BL$14","v":0},{"$f":"Eingabe!$BL$15","v":0},{"$f":"Eingabe!$BL$16","v":0},{"$f":"Eingabe!$BL$17","v":0},{"$f":"Eingabe!$BL$18","v":0},{"$f":"Eingabe!$BL$19","v":0},{"$f":"Eingabe!$BL$20","v":0},{"$f":"Eingabe!$BL$21","v":0},{"$f":"Eingabe!$BL$22","v":0},{"$f":"Eingabe!$BL$23","v":0}]

{"sheet":"JW","index":8,"n_rows":23,"n_cols":6,"rows_kept":23,"cut":false,"hidden":false,"merged":[]}
[{"$f":"Start!F9","v":"2023-10-10"},"FB-Bild"]
["Thema",{"$f":"IF(Berechnung!A9=1,\"SW-Bild\",IF(Berechnung!A9=2,\"Farbbild\",\"Projektionsbild\"))","v":"Projektionsbild"}]
["Platz","Name","Wertung","Bild 1","Bild 2","Bild 3"]
[1,{"$f":"Output!I26","v":"Harald Burmann"},{"$f":"Output!J26","v":24.5},{"$f":"Output!K26","v":8.5},{"$f":"Output!L26","v":8},{"$f":"Output!M26","v":8}]
[2,{"$f":"Output!I28","v":"Tobias Ötzbrugger"},{"$f":"Output!J28","v":23.5},{"$f":"Output!K28","v":8.5},{"$f":"Output!L28","v":7.5},{"$f":"Output!M28","v":7.5}]
[3,{"$f":"Output!I30","v":"Helga Tötsch"},{"$f":"Output!J30","v":21.5},{"$f":"Output!K30","v":7.5},{"$f":"Output!L30","v":6.5},{"$f":"Output!M30","v":7.5}]
[4,{"$f":"Output!I32","v":"Günther Schatz"},{"$f":"Output!J32","v":21},{"$f":"Output!K32","v":7.5},{"$f":"Output!L32","v":6.5},{"$f":"Output!M32","v":7}]
[5,{"$f":"Output!I34","v":"Gottfried Weinhäupl"},{"$f":"Output!J34","v":20},{"$f":"Output!K34","v":6},{"$f":"Output!L34","v":6.5},{"$f":"Output!M34","v":7.5}]
[6,{"$f":"Output!I36","v":""},{"$f":"Output!J36","v":0},{"$f":"Output!K36","v":""},{"$f":"Output!L36","v":""},{"$f":"Output!M36","v":""}]
[7,{"$f":"Output!I38","v":""},{"$f":"Output!J38","v":0},{"$f":"Output!K38","v":""},{"$f":"Output!L38","v":""},{"$f":"Output!M38","v":""}]
[8,{"$f":"Output!I40","v":""},{"$f":"Output!J40","v":0},{"$f":"Output!K40","v":""},{"$f":"Output!L40","v":""},{"$f":"Output!M40","v":""}]
[9,{"$f":"Output!I42","v":""},{"$f":"Output!J42","v":0},{"$f":"Output!K42","v":""},{"$f":"Output!L42","v":""},{"$f":"Output!M42","v":""}]
[10,{"$f":"Output!I44","v":""},{"$f":"Output!J44","v":0},{"$f":"Output!K44","v":""},{"$f":"Output!L44","v":""},{"$f":"Output!M44","v":""}]
[11,{"$f":"Output!I46","v":""},{"$f":"Output!J46","v":0},{"$f":"Output!K46","v":""},{"$f":"Output!L46","v":""},{"$f":"Output!M46","v":""}]
[12,{"$f":"Output!I48","v":""},{"$f":"Output!J48","v":0},{"$f":"Output!K48","v":""},{"$f":"Output!L48","v":""},{"$f":"Output!M48","v":""}]
[13,{"$f":"Output!I50","v":""},{"$f":"Output!J50","v":0},{"$f":"Output!K50","v":""},{"$f":"Output!L50","v":""},{"$f":"Output!M50","v":""}]
[14,{"$f":"Output!I52","v":""},{"$f":"Output!J52","v":0},{"$f":"Output!K52","v":""},{"$f":"Output!L52","v":""},{"$f":"Output!M52","v":""}]
[15,{"$f":"Output!I54","v":""},{"$f":"Output!J54","v":0},{"$f":"Output!K54","v":""},{"$f":"Output!L54","v":""},{"$f":"Output!M54","v":""}]
[16,{"$f":"Output!I56","v":""},{"$f":"Output!J56","v":0},{"$f":"Output!K56","v":""},{"$f":"Output!L56","v":""},{"$f":"Output!M56","v":""}]
[17,{"$f":"Output!I58","v":""},{"$f":"Output!J58","v":0},{"$f":"Output!K58","v":""},{"$f":"Output!L58","v":""},{"$f":"Output!M58","v":""}]
[18,{"$f":"Output!I60","v":""},{"$f":"Output!J60","v":0},{"$f":"Output!K60","v":""},{"$f":"Output!L60","v":""},{"$f":"Output!M60","v":""}]
[19,{"$f":"Output!I62","v":""},{"$f":"Output!J62","v":0},{"$f":"Output!K62","v":""},{"$f":"Output!L62","v":""},{"$f":"Output!M62","v":""}]
[20,{"$f":"Output!I64","v":""},{"$f":"Output!J64","v":0},{"$f":"Output!K64","v":""},{"$f":"Output!L64","v":""},{"$f":"Output!M64","v":""}]

{"sheet":"Details","index":9,"n_rows":69,"n_cols":13,"rows_kept":69,"cut":false,"hidden":false,"merged":[[1,0,1,2],[4,0,4,2],[4,4,4,7],[1,4,1,7]]}
["Teilnehmer",null,null,null,"Sparte"]
[{"$f":"+VLOOKUP(Berechnung!A12,Start!A5:B29,2,FALSE)","v":"Homepage"},null,null,null,{"$f":"Output!I2","v":"Projektionsbild"}]
[]
["Thema:",null,null,null,"Datum:"]
[{"$f":"Start!F11","v":"FREI"},null,null,null,{"$f":"Output!I5","v":"2023-10-10"}]
[]
[]
[">>> EINZELWERTUNG"]
["Foto","Kanditat","Niederster\nWert","Höchster\nWert","Mittel-\nwert",3,4,5,6,7,8,9,10]
[1,{"$f":"IF(Eingabe!E4=0,\"\",+VLOOKUP(\"x\",Eingabe!E4:$BM$23,61,FALSE))","v":"Harald Burmann"},{"$f":"IF(HLOOKUP(A10,Berechnung!$C$2:$BJ$6,3,FALSE)=0,\"\",HLOOKUP(A10,Berechnung!$C$2:$BJ$6,3,FALSE))","v":7},{"$f":"IF(HLOOKUP(A10,Berechnung!$C$2:$BJ$6,4,FALSE)=0,\"\",HLOOKUP(A10,Berechnung!$C$2:$BJ$6,4,FALSE))","v":9},{"$f":"IF(HLOOKUP(A10,Berechnung!$C$2:$BJ$6,5,FALSE)=0,\"\",HLOOKUP(A10,Berechnung!$C$2:$BJ$6,5,FALSE))","v":8.5},{"$f":"COUNTIF(Eingabe!$E$4:$E$23,3)","v":0},{"$f":"COUNTIF(Eingabe!$E$4:$E$23,4)","v":0},{"$f":"COUNTIF(Eingabe!$E$4:$E$23,5)","v":0},{"$f":"COUNTIF(Eingabe!$E$4:$E$23,6)","v":0},{"$f":"COUNTIF(Eingabe!$E$4:$E$23,7)","v":1},{"$f":"COUNTIF(Eingabe!$E$4:$E$23,8)","v":1},{"$f":"COUNTIF(Eingabe!$E$4:$E$23,9)","v":2},{"$f":"COUNTIF(Eingabe!$E$4:$E$23,10)","v":0}]
[2,{"$f":"IF(Eingabe!F4=0,\"\",+VLOOKUP(\"x\",Eingabe!F4:$BM$23,60,FALSE))","v":"Tobias Ötzbrugger"},{"$f":"IF(HLOOKUP(A11,Berechnung!$C$2:$BJ$6,3,FALSE)=0,\"\",HLOOKUP(A11,Berechnung!$C$2:$BJ$6,3,FALSE))","v":7},{"$f":"IF(HLOOKUP(A11,Berechnung!$C$2:$BJ$6,4,FALSE)=0,\"\",HLOOKUP(A11,Berechnung!$C$2:$BJ$6,4,FALSE))","v":10},{"$f":"IF(HLOOKUP(A11,Berechnung!$C$2:$BJ$6,5,FALSE)=0,\"\",HLOOKUP(A11,Berechnung!$C$2:$BJ$6,5,FALSE))","v":8.5},{"$f":"COUNTIF(Eingabe!$F$4:$F$23,$F$9)","v":0},{"$f":"COUNTIF(Eingabe!$F$4:$F$23,$G$9)","v":0},{"$f":"COUNTIF(Eingabe!$F$4:$F$23,$H$9)","v":0},{"$f":"COUNTIF(Eingabe!$F$4:$F$23,$I$9)","v":0},{"$f":"COUNTIF(Eingabe!$F$4:$F$23,$J$9)","v":1},{"$f":"COUNTIF(Eingabe!$F$4:$F$23,$K$9)","v":1},{"$f":"COUNTIF(Eingabe!$F$4:$F$23,$L$9)","v":1},{"$f":"COUNTIF(Eingabe!$F$4:$F$23,$M$9)","v":1}]
[3,{"$f":"IF(Eingabe!G4=0,\"\",+VLOOKUP(\"x\",Eingabe!G4:BM23,59,FALSE))","v":"Günther Schatz"},{"$f":"IF(HLOOKUP(A12,Berechnung!$C$2:$BJ$6,3,FALSE)=0,\"\",HLOOKUP(A12,Berechnung!$C$2:$BJ$6,3,FALSE))","v":7},{"$f":"IF(HLOOKUP(A12,Berechnung!$C$2:$BJ$6,4,FALSE)=0,\"\",HLOOKUP(A12,Berechnung!$C$2:$BJ$6,4,FALSE))","v":9},{"$f":"IF(HLOOKUP(A12,Berechnung!$C$2:$BJ$6,5,FALSE)=0,\"\",HLOOKUP(A12,Berechnung!$C$2:$BJ$6,5,FALSE))","v":7.5},{"$f":"COUNTIF(Eingabe!$G$4:$G$23,F$9)","v":0},{"$f":"COUNTIF(Eingabe!$G$4:$G$23,G$9)","v":0},{"$f":"COUNTIF(Eingabe!$G$4:$G$23,H$9)","v":0},{"$f":"COUNTIF(Eingabe!$G$4:$G$23,I$9)","v":0},{"$f":"COUNTIF(Eingabe!$G$4:$G$23,J$9)","v":2},{"$f":"COUNTIF(Eingabe!$G$4:$G$23,K$9)","v":1},{"$f":"COUNTIF(Eingabe!$G$4:$G$23,L$9)","v":1},{"$f":"COUNTIF(Eingabe!$G$4:$G$23,M$9)","v":0}]
[4,{"$f":"IF(Eingabe!H$4=0,\"\",+VLOOKUP(\"x\",Eingabe!H$4:$BM$23,58,FALSE))","v":"Gottfried Weinhäupl"},{"$f":"IF(HLOOKUP(A13,Berechnung!$C$2:$BJ$6,3,FALSE)=0,\"\",HLOOKUP(A13,Berechnung!$C$2:$BJ$6,3,FALSE))","v":6},{"$f":"IF(HLOOKUP(A13,Berechnung!$C$2:$BJ$6,4,FALSE)=0,\"\",HLOOKUP(A13,Berechnung!$C$2:$BJ$6,4,FALSE))","v":8},{"$f":"IF(HLOOKUP(A13,Berechnung!$C$2:$BJ$6,5,FALSE)=0,\"\",HLOOKUP(A13,Berechnung!$C$2:$BJ$6,5,FALSE))","v":6},{"$f":"COUNTIF(Eingabe!$H$4:$H$23,F$9)","v":0},{"$f":"COUNTIF(Eingabe!$H$4:$H$23,G$9)","v":0},{"$f":"COUNTIF(Eingabe!$H$4:$H$23,H$9)","v":0},{"$f":"COUNTIF(Eingabe!$H$4:$H$23,I$9)","v":3},{"$f":"COUNTIF(Eingabe!$H$4:$H$23,J$9)","v":0},{"$f":"COUNTIF(Eingabe!$H$4:$H$23,K$9)","v":1},{"$f":"COUNTIF(Eingabe!$H$4:$H$23,L$9)","v":0},{"$f":"COUNTIF(Eingabe!$H$4:$H$23,M$9)","v":0}]
[5,{"$f":"IF(Eingabe!I4=0,\"\",+VLOOKUP(\"x\",Eingabe!I4:$BM$23,57,FALSE))","v":"Helga Tötsch"},{"$f":"IF(HLOOKUP(A14,Berechnung!$C$2:$BJ$6,3,FALSE)=0,\"\",HLOOKUP(A14,Berechnung!$C$2:$BJ$6,3,FALSE))","v":7},{"$f":"IF(HLOOKUP(A14,Berechnung!$C$2:$BJ$6,4,FALSE)=0,\"\",HLOOKUP(A14,Berechnung!$C$2:$BJ$6,4,FALSE))","v":10},{"$f":"IF(HLOOKUP(A14,Berechnung!$C$2:$BJ$6,5,FALSE)=0,\"\",HLOOKUP(A14,Berechnung!$C$2:$BJ$6,5,FALSE))","v":7.5},{"$f":"COUNTIF(Eingabe!$I$4:$I$23,F$9)","v":0},{"$f":"COUNTIF(Eingabe!$I$4:$I$23,G$9)","v":0},{"$f":"COUNTIF(Eingabe!$I$4:$I$23,H$9)","v":0},{"$f":"COUNTIF(Eingabe!$I$4:$I$23,I$9)","v":0},{"$f":"COUNTIF(Eingabe!$I$4:$I$23,J$9)","v":2},{"$f":"COUNTIF(Eingabe!$I$4:$I$23,K$9)","v":1},{"$f":"COUNTIF(Eingabe!$I$4:$I$23,L$9)","v":0},{"$f":"COUNTIF(Eingabe!$I$4:$I$23,M$9)","v":1}]
[6,{"$f":"IF(Eingabe!J$4=0,\"\",+VLOOKUP(\"x\",Eingabe!J$4:$BM$23,56,FALSE))","v":"Tobias Ötzbrugger"},{"$f":"IF(HLOOKUP(A15,Berechnung!$C$2:$BJ$6,3,FALSE)=0,\"\",HLOOKUP(A15,Berechnung!$C$2:$BJ$6,3,FALSE))","v":7},{"$f":"IF(HLOOKUP(A15,Berechnung!$C$2:$BJ$6,4,FALSE)=0,\"\",HLOOKUP(A15,Berechnung!$C$2:$BJ$6,4,FALSE))","v":8},{"$f":"IF(HLOOKUP(A15,Berechnung!$C$2:$BJ$6,5,FALSE)=0,\"\",HLOOKUP(A15,Berechnung!$C$2:$BJ$6,5,FALSE))","v":7.5},{"$f":"COUNTIF(Eingabe!$J$4:$J$23,F$9)","v":0},{"$f":"COUNTIF(Eingabe!$J$4:$J$23,G$9)","v":0},{"$f":"COUNTIF(Eingabe!$J$4:$J$23,H$9)","v":0},{"$f":"COUNTIF(Eingabe!$J$4:$J$23,I$9)","v":0},{"$f":"COUNTIF(Eingabe!$J$4:$J$23,J$9)","v":2},{"$f":"COUNTIF(Eingabe!$J$4:$J$23,K$9)","v":2},{"$f":"COUNTIF(Eingabe!$J$4:$J$23,L$9)","v":0},{"$f":"COUNTIF(Eingabe!$J$4:$J$23,M$9)","v":0}]
[7,{"$f":"IF(Eingabe!K$4=0,\"\",+VLOOKUP(\"x\",Eingabe!K$4:$BM$23,55,FALSE))","v":"Harald Burmann"},{"$f":"IF(HLOOKUP(A16,Berechnung!$C$2:$BJ$6,3,FALSE)=0,\"\",HLOOKUP(A16,Berechnung!$C$2:$BJ$6,3,FALSE))","v":7},{"$f":"IF(HLOOKUP(A16,Berechnung!$C$2:$BJ$6,4,FALSE)=0,\"\",HLOOKUP(A16,Berechnung!$C$2:$BJ$6,4,FALSE))","v":10},{"$f":"IF(HLOOKUP(A16,Berechnung!$C$2:$BJ$6,5,FALSE)=0,\"\",HLOOKUP(A16,Berechnung!$C$2:$BJ$6,5,FALSE))","v":8},{"$f":"COUNTIF(Eingabe!$K$4:$K$23,F$9)","v":0},{"$f":"COUNTIF(Eingabe!$K$4:$K$23,G$9)","v":0},{"$f":"COUNTIF(Eingabe!$K$4:$K$23,H$9)","v":0},{"$f":"COUNTIF(Eingabe!$K$4:$K$23,I$9)","v":0},{"$f":"COUNTIF(Eingabe!$K$4:$K$23,J$9)","v":1},{"$f":"COUNTIF(Eingabe!$K$4:$K$23,K$9)","v":2},{"$f":"COUNTIF(Eingabe!$K$4:$K$23,L$9)","v":0},{"$f":"COUNTIF(Eingabe!$K$4:$K$23,M$9)","v":1}]
[8,{"$f":"IF(Eingabe!L$4=0,\"\",+VLOOKUP(\"x\",Eingabe!L$4:$BM$23,54,FALSE))","v":"Gottfried Weinhäupl"},{"$f":"IF(HLOOKUP(A17,Berechnung!$C$2:$BJ$6,3,FALSE)=0,\"\",HLOOKUP(A17,Berechnung!$C$2:$BJ$6,3,FALSE))","v":6},{"$f":"IF(HLOOKUP(A17,Berechnung!$C$2:$BJ$6,4,FALSE)=0,\"\",HLOOKUP(A17,Berechnung!$C$2:$BJ$6,4,FALSE))","v":7},{"$f":"IF(HLOOKUP(A17,Berechnung!$C$2:$BJ$6,5,FALSE)=0,\"\",HLOOKUP(A17,Berechnung!$C$2:$BJ$6,5,FALSE))","v":6.5},{"$f":"COUNTIF(Eingabe!$L$4:$L$23,F$9)","v":0},{"$f":"COUNTIF(Eingabe!$L$4:$L$23,G$9)","v":0},{"$f":"COUNTIF(Eingabe!$L$4:$L$23,H$9)","v":0},{"$f":"COUNTIF(Eingabe!$L$4:$L$23,I$9)","v":2},{"$f":"COUNTIF(Eingabe!$L$4:$L$23,J$9)","v":2},{"$f":"COUNTIF(Eingabe!$L$4:$L$23,K$9)","v":0},{"$f":"COUNTIF(Eingabe!$L$4:$L$23,L$9)","v":0},{"$f":"COUNTIF(Eingabe!$L$4:$L$23,M$9)","v":0}]
[9,{"$f":"IF(Eingabe!M$4=0,\"\",+VLOOKUP(\"x\",Eingabe!M$4:$BM$23,53,FALSE))","v":"Helga Tötsch"},{"$f":"IF(HLOOKUP(A18,Berechnung!$C$2:$BJ$6,3,FALSE)=0,\"\",HLOOKUP(A18,Berechnung!$C$2:$BJ$6,3,FALSE))","v":5},{"$f":"IF(HLOOKUP(A18,Berechnung!$C$2:$BJ$6,4,FALSE)=0,\"\",HLOOKUP(A18,Berechnung!$C$2:$BJ$6,4,FALSE))","v":7},{"$f":"IF(HLOOKUP(A18,Berechnung!$C$2:$BJ$6,5,FALSE)=0,\"\",HLOOKUP(A18,Berechnung!$C$2:$BJ$6,5,FALSE))","v":6.5},{"$f":"COUNTIF(Eingabe!$M$4:$M$23,F$9)","v":0},{"$f":"COUNTIF(Eingabe!$M$4:$M$23,G$9)","v":0},{"$f":"COUNTIF(Eingabe!$M$4:$M$23,H$9)","v":1},{"$f":"COUNTIF(Eingabe!$M$4:$M$23,I$9)","v":1},{"$f":"COUNTIF(Eingabe!$M$4:$M$23,J$9)","v":2},{"$f":"COUNTIF(Eingabe!$M$4:$M$23,K$9)","v":0},{"$f":"COUNTIF(Eingabe!$M$4:$M$23,L$9)","v":0},{"$f":"COUNTIF(Eingabe!$M$4:$M$23,M$9)","v":0}]
[10,{"$f":"IF(Eingabe!N$4=0,\"\",+VLOOKUP(\"x\",Eingabe!N$4:$BM$23,52,FALSE))","v":"Günther Schatz"},{"$f":"IF(HLOOKUP(A19,Berechnung!$C$2:$BJ$6,3,FALSE)=0,\"\",HLOOKUP(A19,Berechnung!$C$2:$BJ$6,3,FALSE))","v":6},{"$f":"IF(HLOOKUP(A19,Berechnung!$C$2:$BJ$6,4,FALSE)=0,\"\",HLOOKUP(A19,Berechnung!$C$2:$BJ$6,4,FALSE))","v":8},{"$f":"IF(HLOOKUP(A19,Berechnung!$C$2:$BJ$6,5,FALSE)=0,\"\",HLOOKUP(A19,Berechnung!$C$2:$BJ$6,5,FALSE))","v":6.5},{"$f":"COUNTIF(Eingabe!$N$4:$N$23,F$9)","v":0},{"$f":"COUNTIF(Eingabe!$N$4:$N$23,G$9)","v":0},{"$f":"COUNTIF(Eingabe!$N$4:$N$23,H$9)","v":0},{"$f":"COUNTIF(Eingabe!$N$4:$N$23,I$9)","v":2},{"$f":"COUNTIF(Eingabe!$N$4:$N$23,J$9)","v":1},{"$f":"COUNTIF(Eingabe!$N$4:$N$23,K$9)","v":1},{"$f":"COUNTIF(Eingabe!$N$4:$N$23,L$9)","v":0},{"$f":"COUNTIF(Eingabe!$N$4:$N$23,M$9)","v":0}]
[11,{"$f":"IF(Eingabe!O$4=0,\"\",+VLOOKUP(\"x\",Eingabe!O$4:$BM$23,51,FALSE))","v":"Tobias Ötzbrugger"},{"$f":"IF(HLOOKUP(A20,Berechnung!$C$2:$BJ$6,3,FALSE)=0,\"\",HLOOKUP(A20,Berechnung!$C$2:$BJ$6,3,FALSE))","v":7},{"$f":"IF(HLOOKUP(A20,Berechnung!$C$2:$BJ$6,4,FALSE)=0,\"\",HLOOKUP(A20,Berechnung!$C$2:$BJ$6,4,FALSE))","v":8},{"$f":"IF(HLOOKUP(A20,Berechnung!$C$2:$BJ$6,5,FALSE)=0,\"\",HLOOKUP(A20,Berechnung!$C$2:$BJ$6,5,FALSE))","v":7.5},{"$f":"COUNTIF(Eingabe!$O$4:$O$23,F$9)","v":0},{"$f":"COUNTIF(Eingabe!$O$4:$O$23,G$9)","v":0},{"$f":"COUNTIF(Eingabe!$O$4:$O$23,H$9)","v":0},{"$f":"COUNTIF(Eingabe!$O$4:$O$23,I$9)","v":0},{"$f":"COUNTIF(Eingabe!$O$4:$O$23,J$9)","v":2},{"$f":"COUNTIF(Eingabe!$O$4:$O$23,K$9)","v":2},{"$f":"COUNTIF(Eingabe!$O$4:$O$23,L$9)","v":0},{"$f":"COUNTIF(Eingabe!$O$4:$O$23,M$9)","v":0}]
[12,{"$f":"IF(Eingabe!P$4=0,\"\",+VLOOKUP(\"x\",Eingabe!P$4:$BM$23,50,FALSE))","v":"Helga Tötsch"},{"$f":"IF(HLOOKUP(A21,Berechnung!$C$2:$BJ$6,3,FALSE)=0,\"\",HLOOKUP(A21,Berechnung!$C$2:$BJ$6,3,FALSE))","v":6},{"$f":"IF(HLOOKUP(A21,Berechnung!$C$2:$BJ$6,4,FALSE)=0,\"\",HLOOKUP(A21,Berechnung!$C$2:$BJ$6,4,FALSE))","v":10},{"$f":"IF(HLOOKUP(A21,Berechnung!$C$2:$BJ$6,5,FALSE)=0,\"\",HLOOKUP(A21,Berechnung!$C$2:$BJ$6,5,FALSE))","v":7.5},{"$f":"COUNTIF(Eingabe!$P$4:$P$23,F$9)","v":0},{"$f":"COUNTIF(Eingabe!$P$4:$P$23,G$9)","v":0},{"$f":"COUNTIF(Eingabe!$P$4:$P$23,H$9)","v":0},{"$f":"COUNTIF(Eingabe!$P$4:$P$23,I$9)","v":1},{"$f":"COUNTIF(Eingabe!$P$4:$P$23,J$9)","v":1},{"$f":"COUNTIF(Eingabe!$P$4:$P$23,K$9)","v":1},{"$f":"COUNTIF(Eingabe!$P$4:$P$23,L$9)","v":0},{"$f":"COUNTIF(Eingabe!$P$4:$P$23,M$9)","v":1}]
[13,{"$f":"IF(Eingabe!Q$4=0,\"\",+VLOOKUP(\"x\",Eingabe!Q$4:$BM$23,49,FALSE))","v":"Günther Schatz"},{"$f":"IF(HLOOKUP(A22,Berechnung!$C$2:$BJ$6,3,FALSE)=0,\"\",HLOOKUP(A22,Berechnung!$C$2:$BJ$6,3,FALSE))","v":7},{"$f":"IF(HLOOKUP(A22,Berechnung!$C$2:$BJ$6,4,FALSE)=0,\"\",HLOOKUP(A22,Berechnung!$C$2:$BJ$6,4,FALSE))","v":9},{"$f":"IF(HLOOKUP(A22,Berechnung!$C$2:$BJ$6,5,FALSE)=0,\"\",HLOOKUP(A22,Berechnung!$C$2:$BJ$6,5,FALSE))","v":7},{"$f":"COUNTIF(Eingabe!$Q$4:$Q$23,F$9)","v":0},{"$f":"COUNTIF(Eingabe!$Q$4:$Q$23,G$9)","v":0},{"$f":"COUNTIF(Eingabe!$Q$4:$Q$23,H$9)","v":0},{"$f":"COUNTIF(Eingabe!$Q$4:$Q$23,I$9)","v":0},{"$f":"COUNTIF(Eingabe!$Q$4:$Q$23,J$9)","v":3},{"$f":"COUNTIF(Eingabe!$Q$4:$Q$23,K$9)","v":0},{"$f":"COUNTIF(Eingabe!$Q$4:$Q$23,L$9)","v":1},{"$f":"COUNTIF(Eingabe!$Q$4:$Q$23,M$9)","v":0}]
[14,{"$f":"IF(Eingabe!R$4=0,\"\",+VLOOKUP(\"x\",Eingabe!R$4:$BM$23,48,FALSE))","v":"Harald Burmann"},{"$f":"IF(HLOOKUP(A23,Berechnung!$C$2:$BJ$6,3,FALSE)=0,\"\",HLOOKUP(A23,Berechnung!$C$2:$BJ$6,3,FALSE))","v":7},{"$f":"IF(HLOOKUP(A23,Berechnung!$C$2:$BJ$6,4,FALSE)=0,\"\",HLOOKUP(A23,Berechnung!$C$2:$BJ$6,4,FALSE))","v":9},{"$f":"IF(HLOOKUP(A23,Berechnung!$C$2:$BJ$6,5,FALSE)=0,\"\",HLOOKUP(A23,Berechnung!$C$2:$BJ$6,5,FALSE))","v":8},{"$f":"COUNTIF(Eingabe!$R$4:$R$23,F$9)","v":0},{"$f":"COUNTIF(Eingabe!$R$4:$R$23,G$9)","v":0},{"$f":"COUNTIF(Eingabe!$R$4:$R$23,H$9)","v":0},{"$f":"COUNTIF(Eingabe!$R$4:$R$23,I$9)","v":0},{"$f":"COUNTIF(Eingabe!$R$4:$R$23,J$9)","v":1},{"$f":"COUNTIF(Eingabe!$R$4:$R$23,K$9)","v":2},{"$f":"COUNTIF(Eingabe!$R$4:$R$23,L$9)","v":1},{"$f":"COUNTIF(Eingabe!$R$4:$R$23,M$9)","v":0}]
[15,{"$f":"IF(Eingabe!S$4=0,\"\",+VLOOKUP(\"x\",Eingabe!S$4:$BM$23,47,FALSE))","v":"Gottfried Weinhäupl"},{"$f":"IF(HLOOKUP(A24,Berechnung!$C$2:$BJ$6,3,FALSE)=0,\"\",HLOOKUP(A24,Berechnung!$C$2:$BJ$6,3,FALSE))","v":7},{"$f":"IF(HLOOKUP(A24,Berechnung!$C$2:$BJ$6,4,FALSE)=0,\"\",HLOOKUP(A24,Berechnung!$C$2:$BJ$6,4,FALSE))","v":8},{"$f":"IF(HLOOKUP(A24,Berechnung!$C$2:$BJ$6,5,FALSE)=0,\"\",HLOOKUP(A24,Berechnung!$C$2:$BJ$6,5,FALSE))","v":7.5},{"$f":"COUNTIF(Eingabe!$S$4:$S$23,F$9)","v":0},{"$f":"COUNTIF(Eingabe!$S$4:$S$23,G$9)","v":0},{"$f":"COUNTIF(Eingabe!$S$4:$S$23,H$9)","v":0},{"$f":"COUNTIF(Eingabe!$S$4:$S$23,I$9)","v":0},{"$f":"COUNTIF(Eingabe!$S$4:$S$23,J$9)","v":2},{"$f":"COUNTIF(Eingabe!$S$4:$S$23,K$9)","v":2},{"$f":"COUNTIF(Eingabe!$S$4:$S$23,L$9)","v":0},{"$f":"COUNTIF(Eingabe!$S$4:$S$23,M$9)","v":0}]
[16,{"$f":"IF(Eingabe!T$4=0,\"\",+VLOOKUP(\"x\",Eingabe!T$4:$BM$23,46,FALSE))","v":""},{"$f":"IF(HLOOKUP(A25,Berechnung!$C$2:$BJ$6,3,FALSE)=0,\"\",HLOOKUP(A25,Berechnung!$C$2:$BJ$6,3,FALSE))","v":"-"},{"$f":"IF(HLOOKUP(A25,Berechnung!$C$2:$BJ$6,4,FALSE)=0,\"\",HLOOKUP(A25,Berechnung!$C$2:$BJ$6,4,FALSE))","v":"-"},{"$f":"IF(HLOOKUP(A25,Berechnung!$C$2:$BJ$6,5,FALSE)=0,\"\",HLOOKUP(A25,Berechnung!$C$2:$BJ$6,5,FALSE))","v":""},{"$f":"COUNTIF(Eingabe!$T$4:$T$23,F$9)","v":0},{"$f":"COUNTIF(Eingabe!$T$4:$T$23,G$9)","v":0},{"$f":"COUNTIF(Eingabe!$T$4:$T$23,H$9)","v":0},{"$f":"COUNTIF(Eingabe!$T$4:$T$23,I$9)","v":0},{"$f":"COUNTIF(Eingabe!$T$4:$T$23,J$9)","v":0},{"$f":"COUNTIF(Eingabe!$T$4:$T$23,K$9)","v":0},{"$f":"COUNTIF(Eingabe!$T$4:$T$23,L$9)","v":0},{"$f":"COUNTIF(Eingabe!$T$4:$T$23,M$9)","v":0}]
[17,{"$f":"IF(Eingabe!U$4=0,\"\",+VLOOKUP(\"x\",Eingabe!U$4:$BM$23,45,FALSE))","v":""},{"$f":"IF(HLOOKUP(A26,Berechnung!$C$2:$BJ$6,3,FALSE)=0,\"\",HLOOKUP(A26,Berechnung!$C$2:$BJ$6,3,FALSE))","v":"-"},{"$f":"IF(HLOOKUP(A26,Berechnung!$C$2:$BJ$6,4,FALSE)=0,\"\",HLOOKUP(A26,Berechnung!$C$2:$BJ$6,4,FALSE))","v":"-"},{"$f":"IF(HLOOKUP(A26,Berechnung!$C$2:$BJ$6,5,FALSE)=0,\"\",HLOOKUP(A26,Berechnung!$C$2:$BJ$6,5,FALSE))","v":""},{"$f":"COUNTIF(Eingabe!$U$4:$U$23,F$9)","v":0},{"$f":"COUNTIF(Eingabe!$U$4:$U$23,G$9)","v":0},{"$f":"COUNTIF(Eingabe!$U$4:$U$23,H$9)","v":0},{"$f":"COUNTIF(Eingabe!$U$4:$U$23,I$9)","v":0},{"$f":"COUNTIF(Eingabe!$U$4:$U$23,J$9)","v":0},{"$f":"COUNTIF(Eingabe!$U$4:$U$23,K$9)","v":0},{"$f":"COUNTIF(Eingabe!$U$4:$U$23,L$9)","v":0},{"$f":"COUNTIF(Eingabe!$U$4:$U$23,M$9)","v":0}]
[18,{"$f":"IF(Eingabe!V$4=0,\"\",+VLOOKUP(\"x\",Eingabe!V$4:$BM$23,44,FALSE))","v":""},{"$f":"IF(HLOOKUP(A27,Berechnung!$C$2:$BJ$6,3,FALSE)=0,\"\",HLOOKUP(A27,Berechnung!$C$2:$BJ$6,3,FALSE))","v":"-"},{"$f":"IF(HLOOKUP(A27,Berechnung!$C$2:$BJ$6,4,FALSE)=0,\"\",HLOOKUP(A27,Berechnung!$C$2:$BJ$6,4,FALSE))","v":"-"},{"$f":"IF(HLOOKUP(A27,Berechnung!$C$2:$BJ$6,5,FALSE)=0,\"\",HLOOKUP(A27,Berechnung!$C$2:$BJ$6,5,FALSE))","v":""},{"$f":"COUNTIF(Eingabe!$V$4:$V$23,F$9)","v":0},{"$f":"COUNTIF(Eingabe!$V$4:$V$23,G$9)","v":0},{"$f":"COUNTIF(Eingabe!$V$4:$V$23,H$9)","v":0},{"$f":"COUNTIF(Eingabe!$V$4:$V$23,I$9)","v":0},{"$f":"COUNTIF(Eingabe!$V$4:$V$23,J$9)","v":0},{"$f":"COUNTIF(Eingabe!$V$4:$V$23,K$9)","v":0},{"$f":"COUNTIF(Eingabe!$V$4:$V$23,L$9)","v":0},{"$f":"COUNTIF(Eingabe!$V$4:$V$23,M$9)","v":0}]
[19,{"$f":"IF(Eingabe!W$4=0,\"\",+VLOOKUP(\"x\",Eingabe!W$4:$BM$23,43,FALSE))","v":""},{"$f":"IF(HLOOKUP(A28,Berechnung!$C$2:$BJ$6,3,FALSE)=0,\"\",HLOOKUP(A28,Berechnung!$C$2:$BJ$6,3,FALSE))","v":"-"},{"$f":"IF(HLOOKUP(A28,Berechnung!$C$2:$BJ$6,4,FALSE)=0,\"\",HLOOKUP(A28,Berechnung!$C$2:$BJ$6,4,FALSE))","v":"-"},{"$f":"IF(HLOOKUP(A28,Berechnung!$C$2:$BJ$6,5,FALSE)=0,\"\",HLOOKUP(A28,Berechnung!$C$2:$BJ$6,5,FALSE))","v":""},{"$f":"COUNTIF(Eingabe!$W$4:$W$23,F$9)","v":0},{"$f":"COUNTIF(Eingabe!$W$4:$W$23,G$9)","v":0},{"$f":"COUNTIF(Eingabe!$W$4:$W$23,H$9)","v":0},{"$f":"COUNTIF(Eingabe!$W$4:$W$23,I$9)","v":0},{"$f":"COUNTIF(Eingabe!$W$4:$W$23,J$9)","v":0},{"$f":"COUNTIF(Eingabe!$W$4:$W$23,K$9)","v":0},{"$f":"COUNTIF(Eingabe!$W$4:$W$23,L$9)","v":0},{"$f":"COUNTIF(Eingabe!$W$4:$W$23,M$9)","v":0}]
[20,{"$f":"IF(Eingabe!X$4=0,\"\",+VLOOKUP(\"x\",Eingabe!X$4:$BM$23,42,FALSE))","v":""},{"$f":"IF(HLOOKUP(A29,Berechnung!$C$2:$BJ$6,3,FALSE)=0,\"\",HLOOKUP(A29,Berechnung!$C$2:$BJ$6,3,FALSE))","v":"-"},{"$f":"IF(HLOOKUP(A29,Berechnung!$C$2:$BJ$6,4,FALSE)=0,\"\",HLOOKUP(A29,Berechnung!$C$2:$BJ$6,4,FALSE))","v":"-"},{"$f":"IF(HLOOKUP(A29,Berechnung!$C$2:$BJ$6,5,FALSE)=0,\"\",HLOOKUP(A29,Berechnung!$C$2:$BJ$6,5,FALSE))","v":""},{"$f":"COUNTIF(Eingabe!$X$4:$X$23,F$9)","v":0},{"$f":"COUNTIF(Eingabe!$X$4:$X$23,G$9)","v":0},{"$f":"COUNTIF(Eingabe!$X$4:$X$23,H$9)","v":0},{"$f":"COUNTIF(Eingabe!$X$4:$X$23,I$9)","v":0},{"$f":"COUNTIF(Eingabe!$X$4:$X$23,J$9)","v":0},{"$f":"COUNTIF(Eingabe!$X$4:$X$23,K$9)","v":0},{"$f":"COUNTIF(Eingabe!$X$4:$X$23,L$9)","v":0},{"$f":"COUNTIF(Eingabe!$X$4:$X$23,M$9)","v":0}]
[21,{"$f":"IF(Eingabe!Y$4=0,\"\",+VLOOKUP(\"x\",Eingabe!Y$4:$BM$23,41,FALSE))","v":""},{"$f":"IF(HLOOKUP(A30,Berechnung!$C$2:$BJ$6,3,FALSE)=0,\"\",HLOOKUP(A30,Berechnung!$C$2:$BJ$6,3,FALSE))","v":"-"},{"$f":"IF(HLOOKUP(A30,Berechnung!$C$2:$BJ$6,4,FALSE)=0,\"\",HLOOKUP(A30,Berechnung!$C$2:$BJ$6,4,FALSE))","v":"-"},{"$f":"IF(HLOOKUP(A30,Berechnung!$C$2:$BJ$6,5,FALSE)=0,\"\",HLOOKUP(A30,Berechnung!$C$2:$BJ$6,5,FALSE))","v":""},{"$f":"COUNTIF(Eingabe!$Y$4:$Y$23,F$9)","v":0},{"$f":"COUNTIF(Eingabe!$Y$4:$Y$23,G$9)","v":0},{"$f":"COUNTIF(Eingabe!$Y$4:$Y$23,H$9)","v":0},{"$f":"COUNTIF(Eingabe!$Y$4:$Y$23,I$9)","v":0},{"$f":"COUNTIF(Eingabe!$Y$4:$Y$23,J$9)","v":0},{"$f":"COUNTIF(Eingabe!$Y$4:$Y$23,K$9)","v":0},{"$f":"COUNTIF(Eingabe!$Y$4:$Y$23,L$9)","v":0},{"$f":"COUNTIF(Eingabe!$Y$4:$Y$23,M$9)","v":0}]
[22,{"$f":"IF(Eingabe!Z$4=0,\"\",+VLOOKUP(\"x\",Eingabe!Z$4:$BM$23,40,FALSE))","v":""},{"$f":"IF(HLOOKUP(A31,Berechnung!$C$2:$BJ$6,3,FALSE)=0,\"\",HLOOKUP(A31,Berechnung!$C$2:$BJ$6,3,FALSE))","v":"-"},{"$f":"IF(HLOOKUP(A31,Berechnung!$C$2:$BJ$6,4,FALSE)=0,\"\",HLOOKUP(A31,Berechnung!$C$2:$BJ$6,4,FALSE))","v":"-"},{"$f":"IF(HLOOKUP(A31,Berechnung!$C$2:$BJ$6,5,FALSE)=0,\"\",HLOOKUP(A31,Berechnung!$C$2:$BJ$6,5,FALSE))","v":""},{"$f":"COUNTIF(Eingabe!$Z$4:$Z$23,F$9)","v":0},{"$f":"COUNTIF(Eingabe!$Z$4:$Z$23,G$9)","v":0},{"$f":"COUNTIF(Eingabe!$Z$4:$Z$23,H$9)","v":0},{"$f":"COUNTIF(Eingabe!$Z$4:$Z$23,I$9)","v":0},{"$f":"COUNTIF(Eingabe!$Z$4:$Z$23,J$9)","v":0},{"$f":"COUNTIF(Eingabe!$Z$4:$Z$23,K$9)","v":0},{"$f":"COUNTIF(Eingabe!$Z$4:$Z$23,L$9)","v":0},{"$f":"COUNTIF(Eingabe!$Z$4:$Z$23,M$9)","v":0}]
[23,{"$f":"IF(Eingabe!AA$4=0,\"\",+VLOOKUP(\"x\",Eingabe!AA$4:$BM$23,39,FALSE))","v":""},{"$f":"IF(HLOOKUP(A32,Berechnung!$C$2:$BJ$6,3,FALSE)=0,\"\",HLOOKUP(A32,Berechnung!$C$2:$BJ$6,3,FALSE))","v":"-"},{"$f":"IF(HLOOKUP(A32,Berechnung!$C$2:$BJ$6,4,FALSE)=0,\"\",HLOOKUP(A32,Berechnung!$C$2:$BJ$6,4,FALSE))","v":"-"},{"$f":"IF(HLOOKUP(A32,Berechnung!$C$2:$BJ$6,5,FALSE)=0,\"\",HLOOKUP(A32,Berechnung!$C$2:$BJ$6,5,FALSE))","v":""},{"$f":"COUNTIF(Eingabe!$AA$4:$AA$23,F$9)","v":0},{"$f":"COUNTIF(Eingabe!$AA$4:$AA$23,G$9)","v":0},{"$f":"COUNTIF(Eingabe!$AA$4:$AA$23,H$9)","v":0},{"$f":"COUNTIF(Eingabe!$AA$4:$AA$23,I$9)","v":0},{"$f":"COUNTIF(Eingabe!$AA$4:$AA$23,J$9)","v":0},{"$f":"COUNTIF(Eingabe!$AA$4:$AA$23,K$9)","v":0},{"$f":"COUNTIF(Eingabe!$AA$4:$AA$23,L$9)","v":0},{"$f":"COUNTIF(Eingabe!$AA$4:$AA$23,M$9)","v":0}]
[24,{"$f":"IF(Eingabe!AB$4=0,\"\",+VLOOKUP(\"x\",Eingabe!AB$4:$BM$23,38,FALSE))","v":""},{"$f":"IF(HLOOKUP(A33,Berechnung!$C$2:$BJ$6,3,FALSE)=0,\"\",HLOOKUP(A33,Berechnung!$C$2:$BJ$6,3,FALSE))","v":"-"},{"$f":"IF(HLOOKUP(A33,Berechnung!$C$2:$BJ$6,4,FALSE)=0,\"\",HLOOKUP(A33,Berechnung!$C$2:$BJ$6,4,FALSE))","v":"-"},{"$f":"IF(HLOOKUP(A33,Berechnung!$C$2:$BJ$6,5,FALSE)=0,\"\",HLOOKUP(A33,Berechnung!$C$2:$BJ$6,5,FALSE))","v":""},{"$f":"COUNTIF(Eingabe!$AB$4:$AB$23,F$9)","v":0},{"$f":"COUNTIF(Eingabe!$AB$4:$AB$23,G$9)","v":0},{"$f":"COUNTIF(Eingabe!$AB$4:$AB$23,H$9)","v":0},{"$f":"COUNTIF(Eingabe!$AB$4:$AB$23,I$9)","v":0},{"$f":"COUNTIF(Eingabe!$AB$4:$AB$23,J$9)","v":0},{"$f":"COUNTIF(Eingabe!$AB$4:$AB$23,K$9)","v":0},{"$f":"COUNTIF(Eingabe!$AB$4:$AB$23,L$9)","v":0},{"$f":"COUNTIF(Eingabe!$AB$4:$AB$23,M$9)","v":0}]
[25,{"$f":"IF(Eingabe!AC$4=0,\"\",+VLOOKUP(\"x\",Eingabe!AC$4:$BM$23,37,FALSE))","v":""},{"$f":"IF(HLOOKUP(A34,Berechnung!$C$2:$BJ$6,3,FALSE)=0,\"\",HLOOKUP(A34,Berechnung!$C$2:$BJ$6,3,FALSE))","v":"-"},{"$f":"IF(HLOOKUP(A34,Berechnung!$C$2:$BJ$6,4,FALSE)=0,\"\",HLOOKUP(A34,Berechnung!$C$2:$BJ$6,4,FALSE))","v":"-"},{"$f":"IF(HLOOKUP(A34,Berechnung!$C$2:$BJ$6,5,FALSE)=0,\"\",HLOOKUP(A34,Berechnung!$C$2:$BJ$6,5,FALSE))","v":""},{"$f":"COUNTIF(Eingabe!$AC$4:$AC$23,F$9)","v":0},{"$f":"COUNTIF(Eingabe!$AC$4:$AC$23,G$9)","v":0},{"$f":"COUNTIF(Eingabe!$AC$4:$AC$23,H$9)","v":0},{"$f":"COUNTIF(Eingabe!$AC$4:$AC$23,I$9)","v":0},{"$f":"COUNTIF(Eingabe!$AC$4:$AC$23,J$9)","v":0},{"$f":"COUNTIF(Eingabe!$AC$4:$AC$23,K$9)","v":0},{"$f":"COUNTIF(Eingabe!$AC$4:$AC$23,L$9)","v":0},{"$f":"COUNTIF(Eingabe!$AC$4:$AC$23,M$9)","v":0}]
[26,{"$f":"IF(Eingabe!AD$4=0,\"\",+VLOOKUP(\"x\",Eingabe!AD$4:$BM$23,36,FALSE))","v":""},{"$f":"IF(HLOOKUP(A35,Berechnung!$C$2:$BJ$6,3,FALSE)=0,\"\",HLOOKUP(A35,Berechnung!$C$2:$BJ$6,3,FALSE))","v":"-"},{"$f":"IF(HLOOKUP(A35,Berechnung!$C$2:$BJ$6,4,FALSE)=0,\"\",HLOOKUP(A35,Berechnung!$C$2:$BJ$6,4,FALSE))","v":"-"},{"$f":"IF(HLOOKUP(A35,Berechnung!$C$2:$BJ$6,5,FALSE)=0,\"\",HLOOKUP(A35,Berechnung!$C$2:$BJ$6,5,FALSE))","v":""},{"$f":"COUNTIF(Eingabe!$AD$4:$AD$23,F$9)","v":0},{"$f":"COUNTIF(Eingabe!$AD$4:$AD$23,G$9)","v":0},{"$f":"COUNTIF(Eingabe!$AD$4:$AD$23,H$9)","v":0},{"$f":"COUNTIF(Eingabe!$AD$4:$AD$23,I$9)","v":0},{"$f":"COUNTIF(Eingabe!$AD$4:$AD$23,J$9)","v":0},{"$f":"COUNTIF(Eingabe!$AD$4:$AD$23,K$9)","v":0},{"$f":"COUNTIF(Eingabe!$AD$4:$AD$23,L$9)","v":0},{"$f":"COUNTIF(Eingabe!$AD$4:$AD$23,M$9)","v":0}]
[27,{"$f":"IF(Eingabe!AE$4=0,\"\",+VLOOKUP(\"x\",Eingabe!AE$4:$BM$23,35,FALSE))","v":""},{"$f":"IF(HLOOKUP(A36,Berechnung!$C$2:$BJ$6,3,FALSE)=0,\"\",HLOOKUP(A36,Berechnung!$C$2:$BJ$6,3,FALSE))","v":"-"},{"$f":"IF(HLOOKUP(A36,Berechnung!$C$2:$BJ$6,4,FALSE)=0,\"\",HLOOKUP(A36,Berechnung!$C$2:$BJ$6,4,FALSE))","v":"-"},{"$f":"IF(HLOOKUP(A36,Berechnung!$C$2:$BJ$6,5,FALSE)=0,\"\",HLOOKUP(A36,Berechnung!$C$2:$BJ$6,5,FALSE))","v":""},{"$f":"COUNTIF(Eingabe!$AE$4:$AE$23,F$9)","v":0},{"$f":"COUNTIF(Eingabe!$AE$4:$AE$23,G$9)","v":0},{"$f":"COUNTIF(Eingabe!$AE$4:$AE$23,H$9)","v":0},{"$f":"COUNTIF(Eingabe!$AE$4:$AE$23,I$9)","v":0},{"$f":"COUNTIF(Eingabe!$AE$4:$AE$23,J$9)","v":0},{"$f":"COUNTIF(Eingabe!$AE$4:$AE$23,K$9)","v":0},{"$f":"COUNTIF(Eingabe!$AE$4:$AE$23,L$9)","v":0},{"$f":"COUNTIF(Eingabe!$AE$4:$AE$23,M$9)","v":0}]
[28,{"$f":"IF(Eingabe!AF$4=0,\"\",+VLOOKUP(\"x\",Eingabe!AF$4:$BM$23,34,FALSE))","v":""},{"$f":"IF(HLOOKUP(A37,Berechnung!$C$2:$BJ$6,3,FALSE)=0,\"\",HLOOKUP(A37,Berechnung!$C$2:$BJ$6,3,FALSE))","v":"-"},{"$f":"IF(HLOOKUP(A37,Berechnung!$C$2:$BJ$6,4,FALSE)=0,\"\",HLOOKUP(A37,Berechnung!$C$2:$BJ$6,4,FALSE))","v":"-"},{"$f":"IF(HLOOKUP(A37,Berechnung!$C$2:$BJ$6,5,FALSE)=0,\"\",HLOOKUP(A37,Berechnung!$C$2:$BJ$6,5,FALSE))","v":""},{"$f":"COUNTIF(Eingabe!$AF$4:$AF$23,F$9)","v":0},{"$f":"COUNTIF(Eingabe!$AF$4:$AF$23,G$9)","v":0},{"$f":"COUNTIF(Eingabe!$AF$4:$AF$23,H$9)","v":0},{"$f":"COUNTIF(Eingabe!$AF$4:$AF$23,I$9)","v":0},{"$f":"COUNTIF(Eingabe!$AF$4:$AF$23,J$9)","v":0},{"$f":"COUNTIF(Eingabe!$AF$4:$AF$23,K$9)","v":0},{"$f":"COUNTIF(Eingabe!$AF$4:$AF$23,L$9)","v":0},{"$f":"COUNTIF(Eingabe!$AF$4:$AF$23,M$9)","v":0}]
[29,{"$f":"IF(Eingabe!AG$4=0,\"\",+VLOOKUP(\"x\",Eingabe!AG$4:$BM$23,33,FALSE))","v":""},{"$f":"IF(HLOOKUP(A38,Berechnung!$C$2:$BJ$6,3,FALSE)=0,\"\",HLOOKUP(A38,Berechnung!$C$2:$BJ$6,3,FALSE))","v":"-"},{"$f":"IF(HLOOKUP(A38,Berechnung!$C$2:$BJ$6,4,FALSE)=0,\"\",HLOOKUP(A38,Berechnung!$C$2:$BJ$6,4,FALSE))","v":"-"},{"$f":"IF(HLOOKUP(A38,Berechnung!$C$2:$BJ$6,5,FALSE)=0,\"\",HLOOKUP(A38,Berechnung!$C$2:$BJ$6,5,FALSE))","v":""},{"$f":"COUNTIF(Eingabe!$AG$4:$AG$23,F$9)","v":0},{"$f":"COUNTIF(Eingabe!$AG$4:$AG$23,G$9)","v":0},{"$f":"COUNTIF(Eingabe!$AG$4:$AG$23,H$9)","v":0},{"$f":"COUNTIF(Eingabe!$AG$4:$AG$23,I$9)","v":0},{"$f":"COUNTIF(Eingabe!$AG$4:$AG$23,J$9)","v":0},{"$f":"COUNTIF(Eingabe!$AG$4:$AG$23,K$9)","v":0},{"$f":"COUNTIF(Eingabe!$AG$4:$AG$23,L$9)","v":0},{"$f":"COUNTIF(Eingabe!$AG$4:$AG$23,M$9)","v":0}]
[30,{"$f":"IF(Eingabe!AH$4=0,\"\",+VLOOKUP(\"x\",Eingabe!AH$4:$BM$23,32,FALSE))","v":""},{"$f":"IF(HLOOKUP(A39,Berechnung!$C$2:$BJ$6,3,FALSE)=0,\"\",HLOOKUP(A39,Berechnung!$C$2:$BJ$6,3,FALSE))","v":"-"},{"$f":"IF(HLOOKUP(A39,Berechnung!$C$2:$BJ$6,4,FALSE)=0,\"\",HLOOKUP(A39,Berechnung!$C$2:$BJ$6,4,FALSE))","v":"-"},{"$f":"IF(HLOOKUP(A39,Berechnung!$C$2:$BJ$6,5,FALSE)=0,\"\",HLOOKUP(A39,Berechnung!$C$2:$BJ$6,5,FALSE))","v":""},{"$f":"COUNTIF(Eingabe!$AH$4:$AH$23,F$9)","v":0},{"$f":"COUNTIF(Eingabe!$AH$4:$AH$23,G$9)","v":0},{"$f":"COUNTIF(Eingabe!$AH$4:$AH$23,H$9)","v":0},{"$f":"COUNTIF(Eingabe!$AH$4:$AH$23,I$9)","v":0},{"$f":"COUNTIF(Eingabe!$AH$4:$AH$23,J$9)","v":0},{"$f":"COUNTIF(Eingabe!$AH$4:$AH$23,K$9)","v":0},{"$f":"COUNTIF(Eingabe!$AH$4:$AH$23,L$9)","v":0},{"$f":"COUNTIF(Eingabe!$AH$4:$AH$23,M$9)","v":0}]
[31,{"$f":"IF(Eingabe!AI$4=0,\"\",+VLOOKUP(\"x\",Eingabe!AI$4:$BM$23,31,FALSE))","v":""},{"$f":"IF(HLOOKUP(A40,Berechnung!$C$2:$BJ$6,3,FALSE)=0,\"\",HLOOKUP(A40,Berechnung!$C$2:$BJ$6,3,FALSE))","v":"-"},{"$f":"IF(HLOOKUP(A40,Berechnung!$C$2:$BJ$6,4,FALSE)=0,\"\",HLOOKUP(A40,Berechnung!$C$2:$BJ$6,4,FALSE))","v":"-"},{"$f":"IF(HLOOKUP(A40,Berechnung!$C$2:$BJ$6,5,FALSE)=0,\"\",HLOOKUP(A40,Berechnung!$C$2:$BJ$6,5,FALSE))","v":""},{"$f":"COUNTIF(Eingabe!$AI$4:$AI$23,F$9)","v":0},{"$f":"COUNTIF(Eingabe!$AI$4:$AI$23,G$9)","v":0},{"$f":"COUNTIF(Eingabe!$AI$4:$AI$23,H$9)","v":0},{"$f":"COUNTIF(Eingabe!$AI$4:$AI$23,I$9)","v":0},{"$f":"COUNTIF(Eingabe!$AI$4:$AI$23,J$9)","v":0},{"$f":"COUNTIF(Eingabe!$AI$4:$AI$23,K$9)","v":0},{"$f":"COUNTIF(Eingabe!$AI$4:$AI$23,L$9)","v":0},{"$f":"COUNTIF(Eingabe!$AI$4:$AI$23,M$9)","v":0}]
[32,{"$f":"IF(Eingabe!AJ$4=0,\"\",+VLOOKUP(\"x\",Eingabe!AJ$4:$BM$23,30,FALSE))","v":""},{"$f":"IF(HLOOKUP(A41,Berechnung!$C$2:$BJ$6,3,FALSE)=0,\"\",HLOOKUP(A41,Berechnung!$C$2:$BJ$6,3,FALSE))","v":"-"},{"$f":"IF(HLOOKUP(A41,Berechnung!$C$2:$BJ$6,4,FALSE)=0,\"\",HLOOKUP(A41,Berechnung!$C$2:$BJ$6,4,FALSE))","v":"-"},{"$f":"IF(HLOOKUP(A41,Berechnung!$C$2:$BJ$6,5,FALSE)=0,\"\",HLOOKUP(A41,Berechnung!$C$2:$BJ$6,5,FALSE))","v":""},{"$f":"COUNTIF(Eingabe!$AJ$4:$AJ$23,F$9)","v":0},{"$f":"COUNTIF(Eingabe!$AJ$4:$AJ$23,G$9)","v":0},{"$f":"COUNTIF(Eingabe!$AJ$4:$AJ$23,H$9)","v":0},{"$f":"COUNTIF(Eingabe!$AJ$4:$AJ$23,I$9)","v":0},{"$f":"COUNTIF(Eingabe!$AJ$4:$AJ$23,J$9)","v":0},{"$f":"COUNTIF(Eingabe!$AJ$4:$AJ$23,K$9)","v":0},{"$f":"COUNTIF(Eingabe!$AJ$4:$AJ$23,L$9)","v":0},{"$f":"COUNTIF(Eingabe!$AJ$4:$AJ$23,M$9)","v":0}]
[33,{"$f":"IF(Eingabe!AK$4=0,\"\",+VLOOKUP(\"x\",Eingabe!AK$4:$BM$23,29,FALSE))","v":""},{"$f":"IF(HLOOKUP(A42,Berechnung!$C$2:$BJ$6,3,FALSE)=0,\"\",HLOOKUP(A42,Berechnung!$C$2:$BJ$6,3,FALSE))","v":"-"},{"$f":"IF(HLOOKUP(A42,Berechnung!$C$2:$BJ$6,4,FALSE)=0,\"\",HLOOKUP(A42,Berechnung!$C$2:$BJ$6,4,FALSE))","v":"-"},{"$f":"IF(HLOOKUP(A42,Berechnung!$C$2:$BJ$6,5,FALSE)=0,\"\",HLOOKUP(A42,Berechnung!$C$2:$BJ$6,5,FALSE))","v":""},{"$f":"COUNTIF(Eingabe!$AK$4:$AK$23,F$9)","v":0},{"$f":"COUNTIF(Eingabe!$AK$4:$AK$23,G$9)","v":0},{"$f":"COUNTIF(Eingabe!$AK$4:$AK$23,H$9)","v":0},{"$f":"COUNTIF(Eingabe!$AK$4:$AK$23,I$9)","v":0},{"$f":"COUNTIF(Eingabe!$AK$4:$AK$23,J$9)","v":0},{"$f":"COUNTIF(Eingabe!$AK$4:$AK$23,K$9)","v":0},{"$f":"COUNTIF(Eingabe!$AK$4:$AK$23,L$9)","v":0},{"$f":"COUNTIF(Eingabe!$AK$4:$AK$23,M$9)","v":0}]
[34,{"$f":"IF(Eingabe!AL$4=0,\"\",+VLOOKUP(\"x\",Eingabe!AL$4:$BM$23,28,FALSE))","v":""},{"$f":"IF(HLOOKUP(A43,Berechnung!$C$2:$BJ$6,3,FALSE)=0,\"\",HLOOKUP(A43,Berechnung!$C$2:$BJ$6,3,FALSE))","v":"-"},{"$f":"IF(HLOOKUP(A43,Berechnung!$C$2:$BJ$6,4,FALSE)=0,\"\",HLOOKUP(A43,Berechnung!$C$2:$BJ$6,4,FALSE))","v":"-"},{"$f":"IF(HLOOKUP(A43,Berechnung!$C$2:$BJ$6,5,FALSE)=0,\"\",HLOOKUP(A43,Berechnung!$C$2:$BJ$6,5,FALSE))","v":""},{"$f":"COUNTIF(Eingabe!$AL$4:$AL$23,F$9)","v":0},{"$f":"COUNTIF(Eingabe!$AL$4:$AL$23,G$9)","v":0},{"$f":"COUNTIF(Eingabe!$AL$4:$AL$23,H$9)","v":0},{"$f":"COUNTIF(Eingabe!$AL$4:$AL$23,I$9)","v":0},{"$f":"COUNTIF(Eingabe!$AL$4:$AL$23,J$9)","v":0},{"$f":"COUNTIF(Eingabe!$AL$4:$AL$23,K$9)","v":0},{"$f":"COUNTIF(Eingabe!$AL$4:$AL$23,L$9)","v":0},{"$f":"COUNTIF(Eingabe!$AL$4:$AL$23,M$9)","v":0}]
[35,{"$f":"IF(Eingabe!AM$4=0,\"\",+VLOOKUP(\"x\",Eingabe!AM$4:$BM$23,27,FALSE))","v":""},{"$f":"IF(HLOOKUP(A44,Berechnung!$C$2:$BJ$6,3,FALSE)=0,\"\",HLOOKUP(A44,Berechnung!$C$2:$BJ$6,3,FALSE))","v":"-"},{"$f":"IF(HLOOKUP(A44,Berechnung!$C$2:$BJ$6,4,FALSE)=0,\"\",HLOOKUP(A44,Berechnung!$C$2:$BJ$6,4,FALSE))","v":"-"},{"$f":"IF(HLOOKUP(A44,Berechnung!$C$2:$BJ$6,5,FALSE)=0,\"\",HLOOKUP(A44,Berechnung!$C$2:$BJ$6,5,FALSE))","v":""},{"$f":"COUNTIF(Eingabe!$AM$4:$AM$23,F$9)","v":0},{"$f":"COUNTIF(Eingabe!$AM$4:$AM$23,G$9)","v":0},{"$f":"COUNTIF(Eingabe!$AM$4:$AM$23,H$9)","v":0},{"$f":"COUNTIF(Eingabe!$AM$4:$AM$23,I$9)","v":0},{"$f":"COUNTIF(Eingabe!$AM$4:$AM$23,J$9)","v":0},{"$f":"COUNTIF(Eingabe!$AM$4:$AM$23,K$9)","v":0},{"$f":"COUNTIF(Eingabe!$AM$4:$AM$23,L$9)","v":0},{"$f":"COUNTIF(Eingabe!$AM$4:$AM$23,M$9)","v":0}]
[36,{"$f":"IF(Eingabe!AN$4=0,\"\",+VLOOKUP(\"x\",Eingabe!AN$4:$BM$23,26,FALSE))","v":""},{"$f":"IF(HLOOKUP(A45,Berechnung!$C$2:$BJ$6,3,FALSE)=0,\"\",HLOOKUP(A45,Berechnung!$C$2:$BJ$6,3,FALSE))","v":"-"},{"$f":"IF(HLOOKUP(A45,Berechnung!$C$2:$BJ$6,4,FALSE)=0,\"\",HLOOKUP(A45,Berechnung!$C$2:$BJ$6,4,FALSE))","v":"-"},{"$f":"IF(HLOOKUP(A45,Berechnung!$C$2:$BJ$6,5,FALSE)=0,\"\",HLOOKUP(A45,Berechnung!$C$2:$BJ$6,5,FALSE))","v":""},{"$f":"COUNTIF(Eingabe!$AN$4:$AN$23,F$9)","v":0},{"$f":"COUNTIF(Eingabe!$AN$4:$AN$23,G$9)","v":0},{"$f":"COUNTIF(Eingabe!$AN$4:$AN$23,H$9)","v":0},{"$f":"COUNTIF(Eingabe!$AN$4:$AN$23,I$9)","v":0},{"$f":"COUNTIF(Eingabe!$AN$4:$AN$23,J$9)","v":0},{"$f":"COUNTIF(Eingabe!$AN$4:$AN$23,K$9)","v":0},{"$f":"COUNTIF(Eingabe!$AN$4:$AN$23,L$9)","v":0},{"$f":"COUNTIF(Eingabe!$AN$4:$AN$23,M$9)","v":0}]
[37,{"$f":"IF(Eingabe!AO$4=0,\"\",+VLOOKUP(\"x\",Eingabe!AO$4:$BM$23,25,FALSE))","v":""},{"$f":"IF(HLOOKUP(A46,Berechnung!$C$2:$BJ$6,3,FALSE)=0,\"\",HLOOKUP(A46,Berechnung!$C$2:$BJ$6,3,FALSE))","v":"-"},{"$f":"IF(HLOOKUP(A46,Berechnung!$C$2:$BJ$6,4,FALSE)=0,\"\",HLOOKUP(A46,Berechnung!$C$2:$BJ$6,4,FALSE))","v":"-"},{"$f":"IF(HLOOKUP(A46,Berechnung!$C$2:$BJ$6,5,FALSE)=0,\"\",HLOOKUP(A46,Berechnung!$C$2:$BJ$6,5,FALSE))","v":""},{"$f":"COUNTIF(Eingabe!$AO$4:$AO$23,F$9)","v":0},{"$f":"COUNTIF(Eingabe!$AO$4:$AO$23,G$9)","v":0},{"$f":"COUNTIF(Eingabe!$AO$4:$AO$23,H$9)","v":0},{"$f":"COUNTIF(Eingabe!$AO$4:$AO$23,I$9)","v":0},{"$f":"COUNTIF(Eingabe!$AO$4:$AO$23,J$9)","v":0},{"$f":"COUNTIF(Eingabe!$AO$4:$AO$23,K$9)","v":0},{"$f":"COUNTIF(Eingabe!$AO$4:$AO$23,L$9)","v":0},{"$f":"COUNTIF(Eingabe!$AO$4:$AO$23,M$9)","v":0}]
[38,{"$f":"IF(Eingabe!AP$4=0,\"\",+VLOOKUP(\"x\",Eingabe!AP$4:$BM$23,24,FALSE))","v":""},{"$f":"IF(HLOOKUP(A47,Berechnung!$C$2:$BJ$6,3,FALSE)=0,\"\",HLOOKUP(A47,Berechnung!$C$2:$BJ$6,3,FALSE))","v":"-"},{"$f":"IF(HLOOKUP(A47,Berechnung!$C$2:$BJ$6,4,FALSE)=0,\"\",HLOOKUP(A47,Berechnung!$C$2:$BJ$6,4,FALSE))","v":"-"},{"$f":"IF(HLOOKUP(A47,Berechnung!$C$2:$BJ$6,5,FALSE)=0,\"\",HLOOKUP(A47,Berechnung!$C$2:$BJ$6,5,FALSE))","v":""},{"$f":"COUNTIF(Eingabe!$AP$4:$AP$23,F$9)","v":0},{"$f":"COUNTIF(Eingabe!$AP$4:$AP$23,G$9)","v":0},{"$f":"COUNTIF(Eingabe!$AP$4:$AP$23,H$9)","v":0},{"$f":"COUNTIF(Eingabe!$AP$4:$AP$23,I$9)","v":0},{"$f":"COUNTIF(Eingabe!$AP$4:$AP$23,J$9)","v":0},{"$f":"COUNTIF(Eingabe!$AP$4:$AP$23,K$9)","v":0},{"$f":"COUNTIF(Eingabe!$AP$4:$AP$23,L$9)","v":0},{"$f":"COUNTIF(Eingabe!$AP$4:$AP$23,M$9)","v":0}]
[39,{"$f":"IF(Eingabe!AQ$4=0,\"\",+VLOOKUP(\"x\",Eingabe!AQ$4:$BM$23,23,FALSE))","v":""},{"$f":"IF(HLOOKUP(A48,Berechnung!$C$2:$BJ$6,3,FALSE)=0,\"\",HLOOKUP(A48,Berechnung!$C$2:$BJ$6,3,FALSE))","v":"-"},{"$f":"IF(HLOOKUP(A48,Berechnung!$C$2:$BJ$6,4,FALSE)=0,\"\",HLOOKUP(A48,Berechnung!$C$2:$BJ$6,4,FALSE))","v":"-"},{"$f":"IF(HLOOKUP(A48,Berechnung!$C$2:$BJ$6,5,FALSE)=0,\"\",HLOOKUP(A48,Berechnung!$C$2:$BJ$6,5,FALSE))","v":""},{"$f":"COUNTIF(Eingabe!$AQ$4:$AQ$23,F$9)","v":0},{"$f":"COUNTIF(Eingabe!$AQ$4:$AQ$23,G$9)","v":0},{"$f":"COUNTIF(Eingabe!$AQ$4:$AQ$23,H$9)","v":0},{"$f":"COUNTIF(Eingabe!$AQ$4:$AQ$23,I$9)","v":0},{"$f":"COUNTIF(Eingabe!$AQ$4:$AQ$23,J$9)","v":0},{"$f":"COUNTIF(Eingabe!$AQ$4:$AQ$23,K$9)","v":0},{"$f":"COUNTIF(Eingabe!$AQ$4:$AQ$23,L$9)","v":0},{"$f":"COUNTIF(Eingabe!$AQ$4:$AQ$23,M$9)","v":0}]
[40,{"$f":"IF(Eingabe!AR$4=0,\"\",+VLOOKUP(\"x\",Eingabe!AR$4:$BM$23,22,FALSE))","v":""},{"$f":"IF(HLOOKUP(A49,Berechnung!$C$2:$BJ$6,3,FALSE)=0,\"\",HLOOKUP(A49,Berechnung!$C$2:$BJ$6,3,FALSE))","v":"-"},{"$f":"IF(HLOOKUP(A49,Berechnung!$C$2:$BJ$6,4,FALSE)=0,\"\",HLOOKUP(A49,Berechnung!$C$2:$BJ$6,4,FALSE))","v":"-"},{"$f":"IF(HLOOKUP(A49,Berechnung!$C$2:$BJ$6,5,FALSE)=0,\"\",HLOOKUP(A49,Berechnung!$C$2:$BJ$6,5,FALSE))","v":""},{"$f":"COUNTIF(Eingabe!$AR$4:$AR$23,F$9)","v":0},{"$f":"COUNTIF(Eingabe!$AR$4:$AR$23,G$9)","v":0},{"$f":"COUNTIF(Eingabe!$AR$4:$AR$23,H$9)","v":0},{"$f":"COUNTIF(Eingabe!$AR$4:$AR$23,I$9)","v":0},{"$f":"COUNTIF(Eingabe!$AR$4:$AR$23,J$9)","v":0},{"$f":"COUNTIF(Eingabe!$AR$4:$AR$23,K$9)","v":0},{"$f":"COUNTIF(Eingabe!$AR$4:$AR$23,L$9)","v":0},{"$f":"COUNTIF(Eingabe!$AR$4:$AR$23,M$9)","v":0}]
[41,{"$f":"IF(Eingabe!AS$4=0,\"\",+VLOOKUP(\"x\",Eingabe!AS$4:$BM$23,21,FALSE))","v":""},{"$f":"IF(HLOOKUP(A50,Berechnung!$C$2:$BJ$6,3,FALSE)=0,\"\",HLOOKUP(A50,Berechnung!$C$2:$BJ$6,3,FALSE))","v":"-"},{"$f":"IF(HLOOKUP(A50,Berechnung!$C$2:$BJ$6,4,FALSE)=0,\"\",HLOOKUP(A50,Berechnung!$C$2:$BJ$6,4,FALSE))","v":"-"},{"$f":"IF(HLOOKUP(A50,Berechnung!$C$2:$BJ$6,5,FALSE)=0,\"\",HLOOKUP(A50,Berechnung!$C$2:$BJ$6,5,FALSE))","v":""},{"$f":"COUNTIF(Eingabe!$AS$4:$AS$23,F$9)","v":0},{"$f":"COUNTIF(Eingabe!$AS$4:$AS$23,G$9)","v":0},{"$f":"COUNTIF(Eingabe!$AS$4:$AS$23,H$9)","v":0},{"$f":"COUNTIF(Eingabe!$AS$4:$AS$23,I$9)","v":0},{"$f":"COUNTIF(Eingabe!$AS$4:$AS$23,J$9)","v":0},{"$f":"COUNTIF(Eingabe!$AS$4:$AS$23,K$9)","v":0},{"$f":"COUNTIF(Eingabe!$AS$4:$AS$23,L$9)","v":0},{"$f":"COUNTIF(Eingabe!$AS$4:$AS$23,M$9)","v":0}]
[42,{"$f":"IF(Eingabe!AT$4=0,\"\",+VLOOKUP(\"x\",Eingabe!AT$4:$BM$23,20,FALSE))","v":""},{"$f":"IF(HLOOKUP(A51,Berechnung!$C$2:$BJ$6,3,FALSE)=0,\"\",HLOOKUP(A51,Berechnung!$C$2:$BJ$6,3,FALSE))","v":"-"},{"$f":"IF(HLOOKUP(A51,Berechnung!$C$2:$BJ$6,4,FALSE)=0,\"\",HLOOKUP(A51,Berechnung!$C$2:$BJ$6,4,FALSE))","v":"-"},{"$f":"IF(HLOOKUP(A51,Berechnung!$C$2:$BJ$6,5,FALSE)=0,\"\",HLOOKUP(A51,Berechnung!$C$2:$BJ$6,5,FALSE))","v":""},{"$f":"COUNTIF(Eingabe!$AT$4:$AT$23,F$9)","v":0},{"$f":"COUNTIF(Eingabe!$AT$4:$AT$23,G$9)","v":0},{"$f":"COUNTIF(Eingabe!$AT$4:$AT$23,H$9)","v":0},{"$f":"COUNTIF(Eingabe!$AT$4:$AT$23,I$9)","v":0},{"$f":"COUNTIF(Eingabe!$AT$4:$AT$23,J$9)","v":0},{"$f":"COUNTIF(Eingabe!$AT$4:$AT$23,K$9)","v":0},{"$f":"COUNTIF(Eingabe!$AT$4:$AT$23,L$9)","v":0},{"$f":"COUNTIF(Eingabe!$AT$4:$AT$23,M$9)","v":0}]
[43,{"$f":"IF(Eingabe!AU$4=0,\"\",+VLOOKUP(\"x\",Eingabe!AU$4:$BM$23,19,FALSE))","v":""},{"$f":"IF(HLOOKUP(A52,Berechnung!$C$2:$BJ$6,3,FALSE)=0,\"\",HLOOKUP(A52,Berechnung!$C$2:$BJ$6,3,FALSE))","v":"-"},{"$f":"IF(HLOOKUP(A52,Berechnung!$C$2:$BJ$6,4,FALSE)=0,\"\",HLOOKUP(A52,Berechnung!$C$2:$BJ$6,4,FALSE))","v":"-"},{"$f":"IF(HLOOKUP(A52,Berechnung!$C$2:$BJ$6,5,FALSE)=0,\"\",HLOOKUP(A52,Berechnung!$C$2:$BJ$6,5,FALSE))","v":""},{"$f":"COUNTIF(Eingabe!$AU$4:$AU$23,F$9)","v":0},{"$f":"COUNTIF(Eingabe!$AU$4:$AU$23,G$9)","v":0},{"$f":"COUNTIF(Eingabe!$AU$4:$AU$23,H$9)","v":0},{"$f":"COUNTIF(Eingabe!$AU$4:$AU$23,I$9)","v":0},{"$f":"COUNTIF(Eingabe!$AU$4:$AU$23,J$9)","v":0},{"$f":"COUNTIF(Eingabe!$AU$4:$AU$23,K$9)","v":0},{"$f":"COUNTIF(Eingabe!$AU$4:$AU$23,L$9)","v":0},{"$f":"COUNTIF(Eingabe!$AU$4:$AU$23,M$9)","v":0}]
[44,{"$f":"IF(Eingabe!AV$4=0,\"\",+VLOOKUP(\"x\",Eingabe!AV$4:$BM$23,18,FALSE))","v":""},{"$f":"IF(HLOOKUP(A53,Berechnung!$C$2:$BJ$6,3,FALSE)=0,\"\",HLOOKUP(A53,Berechnung!$C$2:$BJ$6,3,FALSE))","v":"-"},{"$f":"IF(HLOOKUP(A53,Berechnung!$C$2:$BJ$6,4,FALSE)=0,\"\",HLOOKUP(A53,Berechnung!$C$2:$BJ$6,4,FALSE))","v":"-"},{"$f":"IF(HLOOKUP(A53,Berechnung!$C$2:$BJ$6,5,FALSE)=0,\"\",HLOOKUP(A53,Berechnung!$C$2:$BJ$6,5,FALSE))","v":""},{"$f":"COUNTIF(Eingabe!$AV$4:$AV$23,F$9)","v":0},{"$f":"COUNTIF(Eingabe!$AV$4:$AV$23,G$9)","v":0},{"$f":"COUNTIF(Eingabe!$AV$4:$AV$23,H$9)","v":0},{"$f":"COUNTIF(Eingabe!$AV$4:$AV$23,I$9)","v":0},{"$f":"COUNTIF(Eingabe!$AV$4:$AV$23,J$9)","v":0},{"$f":"COUNTIF(Eingabe!$AV$4:$AV$23,K$9)","v":0},{"$f":"COUNTIF(Eingabe!$AV$4:$AV$23,L$9)","v":0},{"$f":"COUNTIF(Eingabe!$AV$4:$AV$23,M$9)","v":0}]
[45,{"$f":"IF(Eingabe!AW$4=0,\"\",+VLOOKUP(\"x\",Eingabe!AW$4:$BM$23,17,FALSE))","v":""},{"$f":"IF(HLOOKUP(A54,Berechnung!$C$2:$BJ$6,3,FALSE)=0,\"\",HLOOKUP(A54,Berechnung!$C$2:$BJ$6,3,FALSE))","v":"-"},{"$f":"IF(HLOOKUP(A54,Berechnung!$C$2:$BJ$6,4,FALSE)=0,\"\",HLOOKUP(A54,Berechnung!$C$2:$BJ$6,4,FALSE))","v":"-"},{"$f":"IF(HLOOKUP(A54,Berechnung!$C$2:$BJ$6,5,FALSE)=0,\"\",HLOOKUP(A54,Berechnung!$C$2:$BJ$6,5,FALSE))","v":""},{"$f":"COUNTIF(Eingabe!$AW$4:$AW$23,F$9)","v":0},{"$f":"COUNTIF(Eingabe!$AW$4:$AW$23,G$9)","v":0},{"$f":"COUNTIF(Eingabe!$AW$4:$AW$23,H$9)","v":0},{"$f":"COUNTIF(Eingabe!$AW$4:$AW$23,I$9)","v":0},{"$f":"COUNTIF(Eingabe!$AW$4:$AW$23,J$9)","v":0},{"$f":"COUNTIF(Eingabe!$AW$4:$AW$23,K$9)","v":0},{"$f":"COUNTIF(Eingabe!$AW$4:$AW$23,L$9)","v":0},{"$f":"COUNTIF(Eingabe!$AW$4:$AW$23,M$9)","v":0}]
[46,{"$f":"IF(Eingabe!AX$4=0,\"\",+VLOOKUP(\"x\",Eingabe!AX$4:$BM$23,16,FALSE))","v":""},{"$f":"IF(HLOOKUP(A55,Berechnung!$C$2:$BJ$6,3,FALSE)=0,\"\",HLOOKUP(A55,Berechnung!$C$2:$BJ$6,3,FALSE))","v":"-"},{"$f":"IF(HLOOKUP(A55,Berechnung!$C$2:$BJ$6,4,FALSE)=0,\"\",HLOOKUP(A55,Berechnung!$C$2:$BJ$6,4,FALSE))","v":"-"},{"$f":"IF(HLOOKUP(A55,Berechnung!$C$2:$BJ$6,5,FALSE)=0,\"\",HLOOKUP(A55,Berechnung!$C$2:$BJ$6,5,FALSE))","v":""},{"$f":"COUNTIF(Eingabe!$AX$4:$AX$23,F$9)","v":0},{"$f":"COUNTIF(Eingabe!$AX$4:$AX$23,G$9)","v":0},{"$f":"COUNTIF(Eingabe!$AX$4:$AX$23,H$9)","v":0},{"$f":"COUNTIF(Eingabe!$AX$4:$AX$23,I$9)","v":0},{"$f":"COUNTIF(Eingabe!$AX$4:$AX$23,J$9)","v":0},{"$f":"COUNTIF(Eingabe!$AX$4:$AX$23,K$9)","v":0},{"$f":"COUNTIF(Eingabe!$AX$4:$AX$23,L$9)","v":0},{"$f":"COUNTIF(Eingabe!$AX$4:$AX$23,M$9)","v":0}]
[47,{"$f":"IF(Eingabe!AY$4=0,\"\",+VLOOKUP(\"x\",Eingabe!AY$4:$BM$23,15,FALSE))","v":""},{"$f":"IF(HLOOKUP(A56,Berechnung!$C$2:$BJ$6,3,FALSE)=0,\"\",HLOOKUP(A56,Berechnung!$C$2:$BJ$6,3,FALSE))","v":"-"},{"$f":"IF(HLOOKUP(A56,Berechnung!$C$2:$BJ$6,4,FALSE)=0,\"\",HLOOKUP(A56,Berechnung!$C$2:$BJ$6,4,FALSE))","v":"-"},{"$f":"IF(HLOOKUP(A56,Berechnung!$C$2:$BJ$6,5,FALSE)=0,\"\",HLOOKUP(A56,Berechnung!$C$2:$BJ$6,5,FALSE))","v":""},{"$f":"COUNTIF(Eingabe!$AY$4:$AY$23,F$9)","v":0},{"$f":"COUNTIF(Eingabe!$AY$4:$AY$23,G$9)","v":0},{"$f":"COUNTIF(Eingabe!$AY$4:$AY$23,H$9)","v":0},{"$f":"COUNTIF(Eingabe!$AY$4:$AY$23,I$9)","v":0},{"$f":"COUNTIF(Eingabe!$AY$4:$AY$23,J$9)","v":0},{"$f":"COUNTIF(Eingabe!$AY$4:$AY$23,K$9)","v":0},{"$f":"COUNTIF(Eingabe!$AY$4:$AY$23,L$9)","v":0},{"$f":"COUNTIF(Eingabe!$AY$4:$AY$23,M$9)","v":0}]
[48,{"$f":"IF(Eingabe!AZ$4=0,\"\",+VLOOKUP(\"x\",Eingabe!AZ$4:$BM$23,14,FALSE))","v":""},{"$f":"IF(HLOOKUP(A57,Berechnung!$C$2:$BJ$6,3,FALSE)=0,\"\",HLOOKUP(A57,Berechnung!$C$2:$BJ$6,3,FALSE))","v":"-"},{"$f":"IF(HLOOKUP(A57,Berechnung!$C$2:$BJ$6,4,FALSE)=0,\"\",HLOOKUP(A57,Berechnung!$C$2:$BJ$6,4,FALSE))","v":"-"},{"$f":"IF(HLOOKUP(A57,Berechnung!$C$2:$BJ$6,5,FALSE)=0,\"\",HLOOKUP(A57,Berechnung!$C$2:$BJ$6,5,FALSE))","v":""},{"$f":"COUNTIF(Eingabe!$AZ$4:$AZ$23,F$9)","v":0},{"$f":"COUNTIF(Eingabe!$AZ$4:$AZ$23,G$9)","v":0},{"$f":"COUNTIF(Eingabe!$AZ$4:$AZ$23,H$9)","v":0},{"$f":"COUNTIF(Eingabe!$AZ$4:$AZ$23,I$9)","v":0},{"$f":"COUNTIF(Eingabe!$AZ$4:$AZ$23,J$9)","v":0},{"$f":"COUNTIF(Eingabe!$AZ$4:$AZ$23,K$9)","v":0},{"$f":"COUNTIF(Eingabe!$AZ$4:$AZ$23,L$9)","v":0},{"$f":"COUNTIF(Eingabe!$AZ$4:$AZ$23,M$9)","v":0}]
[49,{"$f":"IF(Eingabe!BA$4=0,\"\",+VLOOKUP(\"x\",Eingabe!BA$4:$BM$23,13,FALSE))","v":""},{"$f":"IF(HLOOKUP(A58,Berechnung!$C$2:$BJ$6,3,FALSE)=0,\"\",HLOOKUP(A58,Berechnung!$C$2:$BJ$6,3,FALSE))","v":"-"},{"$f":"IF(HLOOKUP(A58,Berechnung!$C$2:$BJ$6,4,FALSE)=0,\"\",HLOOKUP(A58,Berechnung!$C$2:$BJ$6,4,FALSE))","v":"-"},{"$f":"IF(HLOOKUP(A58,Berechnung!$C$2:$BJ$6,5,FALSE)=0,\"\",HLOOKUP(A58,Berechnung!$C$2:$BJ$6,5,FALSE))","v":""},{"$f":"COUNTIF(Eingabe!$BA$4:$BA$23,F$9)","v":0},{"$f":"COUNTIF(Eingabe!$BA$4:$BA$23,G$9)","v":0},{"$f":"COUNTIF(Eingabe!$BA$4:$BA$23,H$9)","v":0},{"$f":"COUNTIF(Eingabe!$BA$4:$BA$23,I$9)","v":0},{"$f":"COUNTIF(Eingabe!$BA$4:$BA$23,J$9)","v":0},{"$f":"COUNTIF(Eingabe!$BA$4:$BA$23,K$9)","v":0},{"$f":"COUNTIF(Eingabe!$BA$4:$BA$23,L$9)","v":0},{"$f":"COUNTIF(Eingabe!$BA$4:$BA$23,M$9)","v":0}]
[50,{"$f":"IF(Eingabe!BB$4=0,\"\",+VLOOKUP(\"x\",Eingabe!BB$4:$BM$23,12,FALSE))","v":""},{"$f":"IF(HLOOKUP(A59,Berechnung!$C$2:$BJ$6,3,FALSE)=0,\"\",HLOOKUP(A59,Berechnung!$C$2:$BJ$6,3,FALSE))","v":"-"},{"$f":"IF(HLOOKUP(A59,Berechnung!$C$2:$BJ$6,4,FALSE)=0,\"\",HLOOKUP(A59,Berechnung!$C$2:$BJ$6,4,FALSE))","v":"-"},{"$f":"IF(HLOOKUP(A59,Berechnung!$C$2:$BJ$6,5,FALSE)=0,\"\",HLOOKUP(A59,Berechnung!$C$2:$BJ$6,5,FALSE))","v":""},{"$f":"COUNTIF(Eingabe!$BB$4:$BB$23,F$9)","v":0},{"$f":"COUNTIF(Eingabe!$BB$4:$BB$23,G$9)","v":0},{"$f":"COUNTIF(Eingabe!$BB$4:$BB$23,H$9)","v":0},{"$f":"COUNTIF(Eingabe!$BB$4:$BB$23,I$9)","v":0},{"$f":"COUNTIF(Eingabe!$BB$4:$BB$23,J$9)","v":0},{"$f":"COUNTIF(Eingabe!$BB$4:$BB$23,K$9)","v":0},{"$f":"COUNTIF(Eingabe!$BB$4:$BB$23,L$9)","v":0},{"$f":"COUNTIF(Eingabe!$BB$4:$BB$23,M$9)","v":0}]
[51,{"$f":"IF(Eingabe!BC$4=0,\"\",+VLOOKUP(\"x\",Eingabe!BC$4:$BM$23,11,FALSE))","v":""},{"$f":"IF(HLOOKUP(A60,Berechnung!$C$2:$BJ$6,3,FALSE)=0,\"\",HLOOKUP(A60,Berechnung!$C$2:$BJ$6,3,FALSE))","v":"-"},{"$f":"IF(HLOOKUP(A60,Berechnung!$C$2:$BJ$6,4,FALSE)=0,\"\",HLOOKUP(A60,Berechnung!$C$2:$BJ$6,4,FALSE))","v":"-"},{"$f":"IF(HLOOKUP(A60,Berechnung!$C$2:$BJ$6,5,FALSE)=0,\"\",HLOOKUP(A60,Berechnung!$C$2:$BJ$6,5,FALSE))","v":""},{"$f":"COUNTIF(Eingabe!$BC$4:$BC$23,F$9)","v":0},{"$f":"COUNTIF(Eingabe!$BC$4:$BC$23,G$9)","v":0},{"$f":"COUNTIF(Eingabe!$BC$4:$BC$23,H$9)","v":0},{"$f":"COUNTIF(Eingabe!$BC$4:$BC$23,I$9)","v":0},{"$f":"COUNTIF(Eingabe!$BC$4:$BC$23,J$9)","v":0},{"$f":"COUNTIF(Eingabe!$BC$4:$BC$23,K$9)","v":0},{"$f":"COUNTIF(Eingabe!$BC$4:$BC$23,L$9)","v":0},{"$f":"COUNTIF(Eingabe!$BC$4:$BC$23,M$9)","v":0}]
[52,{"$f":"IF(Eingabe!BD$4=0,\"\",+VLOOKUP(\"x\",Eingabe!BD$4:$BM$23,10,FALSE))","v":""},{"$f":"IF(HLOOKUP(A61,Berechnung!$C$2:$BJ$6,3,FALSE)=0,\"\",HLOOKUP(A61,Berechnung!$C$2:$BJ$6,3,FALSE))","v":"-"},{"$f":"IF(HLOOKUP(A61,Berechnung!$C$2:$BJ$6,4,FALSE)=0,\"\",HLOOKUP(A61,Berechnung!$C$2:$BJ$6,4,FALSE))","v":"-"},{"$f":"IF(HLOOKUP(A61,Berechnung!$C$2:$BJ$6,5,FALSE)=0,\"\",HLOOKUP(A61,Berechnung!$C$2:$BJ$6,5,FALSE))","v":""},{"$f":"COUNTIF(Eingabe!$BD$4:$BD$23,F$9)","v":0},{"$f":"COUNTIF(Eingabe!$BD$4:$BD$23,G$9)","v":0},{"$f":"COUNTIF(Eingabe!$BD$4:$BD$23,H$9)","v":0},{"$f":"COUNTIF(Eingabe!$BD$4:$BD$23,I$9)","v":0},{"$f":"COUNTIF(Eingabe!$BD$4:$BD$23,J$9)","v":0},{"$f":"COUNTIF(Eingabe!$BD$4:$BD$23,K$9)","v":0},{"$f":"COUNTIF(Eingabe!$BD$4:$BD$23,L$9)","v":0},{"$f":"COUNTIF(Eingabe!$BD$4:$BD$23,M$9)","v":0}]
[53,{"$f":"IF(Eingabe!BE$4=0,\"\",+VLOOKUP(\"x\",Eingabe!BE$4:$BM$23,9,FALSE))","v":""},{"$f":"IF(HLOOKUP(A62,Berechnung!$C$2:$BJ$6,3,FALSE)=0,\"\",HLOOKUP(A62,Berechnung!$C$2:$BJ$6,3,FALSE))","v":"-"},{"$f":"IF(HLOOKUP(A62,Berechnung!$C$2:$BJ$6,4,FALSE)=0,\"\",HLOOKUP(A62,Berechnung!$C$2:$BJ$6,4,FALSE))","v":"-"},{"$f":"IF(HLOOKUP(A62,Berechnung!$C$2:$BJ$6,5,FALSE)=0,\"\",HLOOKUP(A62,Berechnung!$C$2:$BJ$6,5,FALSE))","v":""},{"$f":"COUNTIF(Eingabe!$BE$4:$BE$23,F$9)","v":0},{"$f":"COUNTIF(Eingabe!$BE$4:$BE$23,G$9)","v":0},{"$f":"COUNTIF(Eingabe!$BE$4:$BE$23,H$9)","v":0},{"$f":"COUNTIF(Eingabe!$BE$4:$BE$23,I$9)","v":0},{"$f":"COUNTIF(Eingabe!$BE$4:$BE$23,J$9)","v":0},{"$f":"COUNTIF(Eingabe!$BE$4:$BE$23,K$9)","v":0},{"$f":"COUNTIF(Eingabe!$BE$4:$BE$23,L$9)","v":0},{"$f":"COUNTIF(Eingabe!$BE$4:$BE$23,M$9)","v":0}]
[54,{"$f":"IF(Eingabe!BF$4=0,\"\",+VLOOKUP(\"x\",Eingabe!BF$4:$BM$23,8,FALSE))","v":""},{"$f":"IF(HLOOKUP(A63,Berechnung!$C$2:$BJ$6,3,FALSE)=0,\"\",HLOOKUP(A63,Berechnung!$C$2:$BJ$6,3,FALSE))","v":"-"},{"$f":"IF(HLOOKUP(A63,Berechnung!$C$2:$BJ$6,4,FALSE)=0,\"\",HLOOKUP(A63,Berechnung!$C$2:$BJ$6,4,FALSE))","v":"-"},{"$f":"IF(HLOOKUP(A63,Berechnung!$C$2:$BJ$6,5,FALSE)=0,\"\",HLOOKUP(A63,Berechnung!$C$2:$BJ$6,5,FALSE))","v":""},{"$f":"COUNTIF(Eingabe!$BF$4:$BF$23,F$9)","v":0},{"$f":"COUNTIF(Eingabe!$BF$4:$BF$23,G$9)","v":0},{"$f":"COUNTIF(Eingabe!$BF$4:$BF$23,H$9)","v":0},{"$f":"COUNTIF(Eingabe!$BF$4:$BF$23,I$9)","v":0},{"$f":"COUNTIF(Eingabe!$BF$4:$BF$23,J$9)","v":0},{"$f":"COUNTIF(Eingabe!$BF$4:$BF$23,K$9)","v":0},{"$f":"COUNTIF(Eingabe!$BF$4:$BF$23,L$9)","v":0},{"$f":"COUNTIF(Eingabe!$BF$4:$BF$23,M$9)","v":0}]
[55,{"$f":"IF(Eingabe!BG$4=0,\"\",+VLOOKUP(\"x\",Eingabe!BG$4:$BM$23,7,FALSE))","v":""},{"$f":"IF(HLOOKUP(A64,Berechnung!$C$2:$BJ$6,3,FALSE)=0,\"\",HLOOKUP(A64,Berechnung!$C$2:$BJ$6,3,FALSE))","v":"-"},{"$f":"IF(HLOOKUP(A64,Berechnung!$C$2:$BJ$6,4,FALSE)=0,\"\",HLOOKUP(A64,Berechnung!$C$2:$BJ$6,4,FALSE))","v":"-"},{"$f":"IF(HLOOKUP(A64,Berechnung!$C$2:$BJ$6,5,FALSE)=0,\"\",HLOOKUP(A64,Berechnung!$C$2:$BJ$6,5,FALSE))","v":""}]
[56,{"$f":"IF(Eingabe!BH$4=0,\"\",+VLOOKUP(\"x\",Eingabe!BH$4:$BM$23,6,FALSE))","v":""},{"$f":"IF(HLOOKUP(A65,Berechnung!$C$2:$BJ$6,3,FALSE)=0,\"\",HLOOKUP(A65,Berechnung!$C$2:$BJ$6,3,FALSE))","v":"-"},{"$f":"IF(HLOOKUP(A65,Berechnung!$C$2:$BJ$6,4,FALSE)=0,\"\",HLOOKUP(A65,Berechnung!$C$2:$BJ$6,4,FALSE))","v":"-"},{"$f":"IF(HLOOKUP(A65,Berechnung!$C$2:$BJ$6,5,FALSE)=0,\"\",HLOOKUP(A65,Berechnung!$C$2:$BJ$6,5,FALSE))","v":""}]
[57,{"$f":"IF(Eingabe!BI$4=0,\"\",+VLOOKUP(\"x\",Eingabe!BI$4:$BM$23,5,FALSE))","v":""},{"$f":"IF(HLOOKUP(A66,Berechnung!$C$2:$BJ$6,3,FALSE)=0,\"\",HLOOKUP(A66,Berechnung!$C$2:$BJ$6,3,FALSE))","v":"-"},{"$f":"IF(HLOOKUP(A66,Berechnung!$C$2:$BJ$6,4,FALSE)=0,\"\",HLOOKUP(A66,Berechnung!$C$2:$BJ$6,4,FALSE))","v":"-"},{"$f":"IF(HLOOKUP(A66,Berechnung!$C$2:$BJ$6,5,FALSE)=0,\"\",HLOOKUP(A66,Berechnung!$C$2:$BJ$6,5,FALSE))","v":""}]
[58,{"$f":"IF(Eingabe!BJ$4=0,\"\",+VLOOKUP(\"x\",Eingabe!BJ$4:$BM$23,4,FALSE))","v":""},{"$f":"IF(HLOOKUP(A67,Berechnung!$C$2:$BJ$6,3,FALSE)=0,\"\",HLOOKUP(A67,Berechnung!$C$2:$BJ$6,3,FALSE))","v":"-"},{"$f":"IF(HLOOKUP(A67,Berechnung!$C$2:$BJ$6,4,FALSE)=0,\"\",HLOOKUP(A67,Berechnung!$C$2:$BJ$6,4,FALSE))","v":"-"},{"$f":"IF(HLOOKUP(A67,Berechnung!$C$2:$BJ$6,5,FALSE)=0,\"\",HLOOKUP(A67,Berechnung!$C$2:$BJ$6,5,FALSE))","v":""}]
[59,{"$f":"IF(Eingabe!BK$4=0,\"\",+VLOOKUP(\"x\",Eingabe!BK$4:$BM$23,3,FALSE))","v":""},{"$f":"IF(HLOOKUP(A68,Berechnung!$C$2:$BJ$6,3,FALSE)=0,\"\",HLOOKUP(A68,Berechnung!$C$2:$BJ$6,3,FALSE))","v":"-"},{"$f":"IF(HLOOKUP(A68,Berechnung!$C$2:$BJ$6,4,FALSE)=0,\"\",HLOOKUP(A68,Berechnung!$C$2:$BJ$6,4,FALSE))","v":"-"},{"$f":"IF(HLOOKUP(A68,Berechnung!$C$2:$BJ$6,5,FALSE)=0,\"\",HLOOKUP(A68,Berechnung!$C$2:$BJ$6,5,FALSE))","v":""}]
[60,{"$f":"IF(Eingabe!BL$4=0,\"\",+VLOOKUP(\"x\",Eingabe!BL$4:$BM$23,2,FALSE))","v":""},{"$f":"IF(HLOOKUP(A69,Berechnung!$C$2:$BJ$6,3,FALSE)=0,\"\",HLOOKUP(A69,Berechnung!$C$2:$BJ$6,3,FALSE))","v":"-"},{"$f":"IF(HLOOKUP(A69,Berechnung!$C$2:$BJ$6,4,FALSE)=0,\"\",HLOOKUP(A69,Berechnung!$C$2:$BJ$6,4,FALSE))","v":"-"},{"$f":"IF(HLOOKUP(A69,Berechnung!$C$2:$BJ$6,5,FALSE)=0,\"\",HLOOKUP(A69,Berechnung!$C$2:$BJ$6,5,FALSE))","v":""}]